{"text_format":"1","workbook":"xlsx","n_sheets":21,"sheets":["Konfig","Jänner","Februar","März","April","Mai","Juni","Juli","August","September","Oktober","November","Dezember","Monat","Hilfskonfig","Feiertage","MakroTest","Dummy","Format","FormatAlt","Test"],"not_rendered":{"charts":0,"images":15,"macros":1,"external_links":0,"defined_names":103,"comments":0,"pivot_tables":0},"unopened":[],"bounds":{"document_bytes":16777216,"sheet_cells":100000,"rows_first":2000,"rows_last":500,"rows_between":2000,"halvings":0,"cell_chars":16384,"cell_head_chars":4096},"cells_cut":0,"cells_raw":0,"read":"whole","date_system":"1900"}

{"sheet":"Konfig","index":0,"n_rows":23,"n_cols":38,"rows_kept":23,"cut":false,"hidden":true,"merged":[[9,1,9,7],[9,9,9,12],[10,0,10,12],[6,9,6,12],[6,1,6,7],[7,1,7,7],[7,9,7,12],[8,1,8,7],[22,0,22,7],[21,0,21,7],[21,9,21,12],[22,9,22,12],[11,0,15,0],[14,3,14,5],[12,2,12,6],[13,2,13,6],[20,9,20,12],[16,9,16,12],[17,9,17,12],[18,9,18,12],[19,9,19,12],[15,9,15,12],[12,8,13,12],[11,1,11,7],[1,0,1,5],[0,0,0,11],[2,8,2,11],[4,9,4,12],[5,9,5,12],[4,1,4,7],[3,1,3,7],[3,8,3,11],[2,0,8,0],[0,12,1,12],[2,1,2,7],[5,1,5,7],[8,9,8,12],[14,36,15,36],[14,37,15,37],[13,33,13,34],[0,22,0,24],[14,32,15,32],[14,35,15,35],[14,31,15,31],[14,22,14,25],[14,20,14,21],[12,13,12,14],[13,13,13,14],[11,8,11,12],[14,9,14,12],[14,13,14,15],[14,16,14,17],[14,18,14,19]]}
[" Zeiterfassung für Allgemeines Personal",null,null,null,null,null,null,null,null,null,null,null,null,"Jahressaldo","Kernzeit%","KZOK","WAZVZOK","WAZTZOK","WAZOK","KonfigOK","Tages\nEinträge","Adresse\nTages Einträge","KZSL-Tabelle",null,null,"KZSZeile","MacroTest","AktivesSheet"]
[{"$f":"\" Konfigurationstabelle\"","v":" Konfigurationstabelle"},null,null,null,null,null,null,null,null,null,null,null,null,{"$f":"\"Dezember!$I$43\"","v":"Dezember!$I$43"},{"$f":"IF(WAZ>0,ROUND(($P$22/$O$22)*(24*4),0)/(24*4),1)","v":0.57291666666666663},{"$f":"AND(Zeitmodell=\"Teilzeit\",KZProzent<=0.75)","v":false},{"$f":"AND(Zeitmodell=\"Vollzeit\",WAZ*24=40)","v":true},{"$f":"AND(Zeitmodell=\"Teilzeit\",WAZ*24<40,WAZ*24>0)","v":false},{"$f":"OR(WAZVZOK,WAZTZOK)","v":true},{"$f":"IF(Zeitmodell=\"Teilzeit\",AND(KZOK,WAZOK),WAZOK)","v":true},{"$f":"IF(ISERROR(INDIRECT($V$2)),0,INDIRECT($V$2))","v":0},"Dezember!$S$3","Nummer","KZSL-Adr","KZSR-Adr",0,false,"Konfig"]
["Allgemein","Mitarbeiter/in: ",null,null,null,null,null,null,"Vorname Nachname",null,null,null,"< Vor- und Nachname \n< des Mitarbeiters",null,null,null,null,null,null,null,null,null,0,false,false,null,"Konfig"]
[null,"Vorgesetze/r: ",null,null,null,null,null,null,"Vorname Nachname",null,null,null,"< Vor- und Nachname \n< des Vorgesetzten",null,null,null,null,null,null,null,null,null,1,{"$f":"\"$AH17\"","v":"$AH17"},{"$f":"\"$AI17\"","v":"$AI17"}]
[null,"Org.-Einheit: ",null,null,null,null,null,null,"HXXXXX","< Hier die Org-Nr. der Einrichtung eingeben",null,null,null,"Gültigkeit Jahr und Übertrag",null,null,null,null,null,null,null,null,2,{"$f":"\"$AH18\"","v":"$AH18"},{"$f":"\"$AI18\"","v":"$AI18"}]
[null,"Jahr: ",null,null,null,null,null,null,2023,"< Hier das Jahr eingeben (Achtung: Bei der Eingabe einer neuen Jahreszahl werden alle\n< Monatsblätter gelöscht, und diese danach mit leeren Eingabefeldern wieder neu erstellt.)",null,null,null,{"$f":"AND(ISNUMBER($I$6),$I$6>2009,$I$6<8001)","v":true},null,null,null,null,null,null,null,null,3,{"$f":"\"$AH19\"","v":"$AH19"},{"$f":"\"$AI19\"","v":"$AI19"}]
[null,"Arbeitsstunden-Übertrag Vorjahr: ",null,null,null,null,null,null,0,"< Hier den Übertrag der Arbeitsstunden des Vorjahres eingeben",null,null,null,{"$f":"AND(ISNUMBER($I$7))","v":true},null,null,null,null,null,null,null,null,4,{"$f":"\"$AH20\"","v":"$AH20"},{"$f":"\"$AI20\"","v":"$AI20"}]
[null,"Zeitmodus: ",null,null,null,null,null,null,"Gleitzeit","< Hier über Auswahl-Liste den Zeitmodus für Gleitzeit oder keine GZ (keine Gleitzeit) wählen",null,null,null,{"$f":"AND(ISNUMBER($I$7))","v":true},null,null,null,null,null,null,null,null,5,"$AH21","$AI21"]
[null,"Zeitmodell: ",null,null,null,null,null,null,"Vollzeit","< Hier über Auswahl-Liste das Zeitmodell für Vollzeit oder Teilzeit wählen",null,null,null,{"$f":"AND(ISNUMBER($I$7))","v":true}]
[]
[{"$f":"\" Definition der Normalarbeitszeit (=Dienstplan)\"&IF(Zeitmodell=\"Teilzeit\",\" und ermitteln der Kernzeit \",\"\")&\" für die Woche\"","v":" Definition der Normalarbeitszeit (=Dienstplan) für die Woche"},null,null,null,null,null,null,null,null,null,null,null,null,"Text bei Vollzeit","Text bei Teilzeit","Text bei VZ Gesperrt","Text bei TZ Gesperrt","KernzeitText bei VZ","KernzeitText bei TZ"]
["Wochentage",{"$f":"IF(Zeitmodus=C_Gleitzeit,\"Gleitzeitrahmen\",\"keine Gleitzeit\")","v":"Gleitzeitrahmen"},null,null,null,null,null,null,{"$f":"IF(MakroTest,\" Eingabestatus: \"&IF(KonfigOK,\"OK\",\"Fehler!\"),\"Makros sind nicht aktiv!\")","v":"Makros sind nicht aktiv!"},null,null,null,null,"Momentan ist der Vollzeitmodus aktiviert. Klicken Sie mit der linken Maustaste auf die Schaltfläche darunter für Teilzeitmodus","Momentan ist der Teilzeitmodus aktiviert. Klicken Sie mit der linken Maustaste auf die Schaltfläche darunter für Vollzeitmodus","Momentan ist der Vollzeitmodus aktiviert. \nDer Zeitmodus kann nicht verändert werden, da in \nden Monatsblättern \nEinträge vorhanden sind.","Momentan ist der Teilzeitmodus aktiviert. \nDer Zeitmodus kann nicht verändert werden, da in \nden Monatsblättern \nEinträge vorhanden sind.","  Achtung: Die Kernzeit ist im Vollzeitmodus vorgegeben und kann hier nicht verändert werden."," Die Kernzeit berechnet sich im Teilzeitmodus automatisch. Mit den Schaltflächen \"15min\" darf\n die Kernzeit für jeden Tag in 15min-Schritten innerhalb der Normalarbeitszeit verschoben werden."]
[null,null,{"$f":"\"Normalarbeitszeit\"&CHAR(10)&\"(=Dienstplan \"&TEXT(WAZ,\"[hh]:mm\")&\"h)\"","v":"Normalarbeitszeit\n(=Dienstplan 40:00h)"},null,null,null,null,null,{"$f":"IF(MakroTest,IF(TEin=0,IF($P$14=\"\",\"Alle Eingaben sind korrekt durchgeführt!\",$P$14),\"Achtung: Sie können bei der Dienstplankonfiguration keine Änderungen mehr vornehmen, da Sie in den Monatsblättern Daten eingetragen haben!\"),\"Bitte lesen Sie unten in der Beschreibung mehr über das Einschalten von Makros nach. Ohne Makros funktioniert die Tabelle nicht!\")","v":"Bitte lesen Sie unten in der Beschreibung mehr über das Einschalten von Makros nach. Ohne Makros funktioniert die Tabelle nicht!"},null,null,null,null,"Statustext",null,"FehlerMldg"]
[null,null,"Vollzeit",null,null,null,null,null,null,null,null,null,null,"Eingabestatus: ",null,{"$f":"IF(Zeitmodell=\"Teilzeit\",IF(NOT(WAZOK),\"Teilzeit-Fehler1: Wochenarbeitszeit ist größer,gleich 40 Stunden oder 0!\"&CHAR(10),\"\")&IF(NOT(KZOK),\"Teilzeit-Fehler2: Die Kernzeit beträgt mehr als 75% der Normalarbeitszeit!\",\"\"),IF(NOT(WAZOK),\" Vollzeit Fehler: Die Normalarbeitszeit beträgt nicht 40 Stunden!\",\"\"))","v":""},null,null,null,null,null,null,null,null,null,null,null,null,null,null,null,null,null,"KZShift-Status"]
[null,null,null,"Kernzeit",null,null,null,null,"TAZ"," Beschreibung der Eingabe- und Berechnungsfelder \n ",null,null,null,"Gesamtstundenberechnung",null,null,"NAZ Teilzeit gültig",null,"NAZ Vollzeit gültig",null,"NAZ gültig",null,"Umrechnung auf 25-Minutenwerte",null,null,null,"Abzugswerte",null,null,null,null,"75%NAZ","Offset \nKZ-Beginn","KZSL","KZSR","Offset Toleranz","Offset Teilzeit Standard","Offset KZ-Beginn + Offset Teilzeit Standard"]
[null,"Gleitzeit Von","Normal AZ Von","Kernzeit Von","Prozent von NAZ","Kernzeit Bis","Normal AZ Bis","Gleitzeit Bis","Tages Arbeitszeit",{"$f":"IF(Zeitmodus=\"Gleitzeit\",IF(Zeitmodell=\"Vollzeit\",$R$12,$S$12),\"Im Zeitmodus 'keine Gleitzeit' entfällt die Kernzeit\")","v":"  Achtung: Die Kernzeit ist im Vollzeitmodus vorgegeben und kann hier nicht verändert werden."},null,null,null,"GLZ-Std.","NAZ-Std.","Kernzeit-Std.","Von","Bis","Von","Bis","Von","Bis","NAZ-Von25","Kern-Von25","Kern-Bis25","NAZ-Bis25","NAZ25","KernZeit25","KZ% von NAZ","(NAZ-KZ)/2","KZ% von NAZ",null,null,{"$f":"IF(OR(KZSZeile=0,Zeitmodell=\"Vollzeit\",TEin>0,NOT(MakroTest)),FALSE,INDIRECT(VLOOKUP(KZSZeile,KZSTab,2,FALSE)))","v":false},{"$f":"IF(OR(KZSZeile=0,Zeitmodell=\"Vollzeit\",TEin>0,NOT(MakroTest)),FALSE,INDIRECT(VLOOKUP(KZSZeile,KZSTab,3,FALSE)))","v":false}]
["Mo",{"$f":" TIME(7,0,0)","v":"07:00:00"},"08:00:00",{"$f":"IF(Zeitmodell=\"Vollzeit\",Hilfskonfig!F3,$C17+$AG17)","v":"09:00:00"},{"$f":"$AC17","v":0.625},{"$f":"IF(Zeitmodell=\"Vollzeit\",Hilfskonfig!G3,$C17+$AF17+AG17)","v":"14:00:00"},"16:00:00","18:00:00",{"$f":"$G17-$C17","v":"08:00:00"},{"$f":"\"< Von- und Bis-Normalarbeitszeit für \"&$A17&\" im Format [hh:mm] im weissen Feld eingeben\"&IF(OR(Zeitmodell=\"Vollzeit\",Zeitmodus<>\"Gleitzeit\"),\"\",CHAR(10)&\"< Von- und Bis-Kernzeit für \"&$A17&\" ändert sich automatisch auf ca. 75% der Normalarbeitszeit\")","v":"< Von- und Bis-Normalarbeitszeit für Mo im Format [hh:mm] im weissen Feld eingeben"},null,null,null,{"$f":"H17-B17","v":0.45833333333333331},{"$f":"G17-C17","v":0.33333333333333331},{"$f":"F17-D17","v":0.20833333333333337},{"$f":"AND(ISNUMBER($C17),ROUND($C17*24*4,0)/(24*4)=$C17,$C17>=$B17,$C17<=$H17)","v":true},{"$f":"AND(ISNUMBER($G17),ROUND($G17*24*4,0)/(24*4)=$G17,$G17>=$B17,$G17<=$H17)","v":true},{"$f":"AND(ISNUMBER($C17),ROUND($C17*24*4,0)/(24*4)=$C17,$C17>=$B17,$C17<=$D17)","v":true},{"$f":"AND(ISNUMBER($G17),ROUND($G17*24*4,0)/(24*4)=$G17,$G17>=$F17,$G17<=$H17)","v":true},{"$f":"IF(Zeitmodus=\"Gleitzeit\",IF(Zeitmodell=\"Teilzeit\",$Q17,$S17),AND(ISNUMBER($C17),$C17<=$G17))","v":true},{"$f":"IF(Zeitmodus=\"Gleitzeit\",IF(Zeitmodell=\"Teilzeit\",$R17,$T17),AND(ISNUMBER($C17),$C17<=$G17))","v":true},{"$f":"C17*24*4","v":32},36,{"$f":"F17*24*4","v":56},64,{"$f":"$Z17-$W17","v":32},{"$f":"($Y17-$X17)","v":20},{"$f":"IF($AA17=0,0,$AB17/$AA17)","v":0.625},{"$f":"ROUND(($AA17-$AB17)/2,0)/(24*4)","v":"01:30:00"},0.75,{"$f":"INT($AA17*$AE17)/(24*4)","v":"06:00:00"},"00:00:00",{"$f":"$C17<$D17","v":true},{"$f":"$G17>$F17","v":true},{"$f":"($G17-$C17)-($F17-$D17)","v":"03:00:00"},{"$f":"ROUND(($AJ17*24*4)/2,0)/(24*4)","v":"01:30:00"},{"$f":"$AK17+$AG17","v":"01:30:00"}]
["Di","07:00:00","08:00:00",{"$f":"IF(Zeitmodell=\"Vollzeit\",Hilfskonfig!F4,$C18+$AG18)","v":"09:00:00"},{"$f":"$AC18","v":0.625},{"$f":"IF(Zeitmodell=\"Vollzeit\",Hilfskonfig!G4,$C18+$AF18+AG18)","v":"14:00:00"},"16:00:00","18:00:00",{"$f":"$G18-$C18","v":"08:00:00"},{"$f":"\"< Von- und Bis-Normalarbeitszeit für \"&$A18&\" im Format [hh:mm] im weissen Feld eingeben\"&IF(OR(Zeitmodell=\"Vollzeit\",Zeitmodus<>\"Gleitzeit\"),\"\",CHAR(10)&\"< Von- und Bis-Kernzeit für \"&$A18&\" ändert sich automatisch auf ca. 75% der Normalarbeitszeit\")","v":"< Von- und Bis-Normalarbeitszeit für Di im Format [hh:mm] im weissen Feld eingeben"},null,null,null,{"$f":"H18-B18","v":0.45833333333333331},{"$f":"G18-C18","v":0.33333333333333331},{"$f":"F18-D18","v":0.20833333333333337},{"$f":"AND(ISNUMBER($C18),ROUND($C18*24*4,0)/(24*4)=$C18,$C18>=$B18,$C18<=$H18)","v":true},{"$f":"AND(ISNUMBER($G18),ROUND($G18*24*4,0)/(24*4)=$G18,$G18>=$B18,$G18<=$H18)","v":true},{"$f":"AND(ISNUMBER($C18),ROUND($C18*24*4,0)/(24*4)=$C18,$C18>=$B18,$C18<=$D18)","v":true},{"$f":"AND(ISNUMBER($G18),ROUND($G18*24*4,0)/(24*4)=$G18,$G18>=$F18,$G18<=$H18)","v":true},{"$f":"IF(Zeitmodus=\"Gleitzeit\",IF(Zeitmodell=\"Teilzeit\",$Q18,$S18),AND(ISNUMBER($C18),$C18<=$G18))","v":true},{"$f":"IF(Zeitmodus=\"Gleitzeit\",IF(Zeitmodell=\"Teilzeit\",$R18,$T18),AND(ISNUMBER($C18),$C18<=$G18))","v":true},32,36,56,64,{"$f":"$Z18-$W18","v":32},{"$f":"($Y18-$X18)","v":20},{"$f":"IF($AA18=0,0,$AB18/$AA18)","v":0.625},{"$f":"ROUND(($AA18-$AB18)/2,0)/(24*4)","v":"01:30:00"},0.75,{"$f":"INT($AA18*$AE18)/(24*4)","v":"06:00:00"},"00:00:00",{"$f":"$C18<$D18","v":true},{"$f":"$G18>$F18","v":true},{"$f":"($G18-$C18)-($F18-$D18)","v":"03:00:00"},{"$f":"ROUND(($AJ18*24*4)/2,0)/(24*4)","v":"01:30:00"},{"$f":"$AK18+$AG18","v":"01:30:00"}]
["Mi","07:00:00","08:00:00",{"$f":"IF(Zeitmodell=\"Vollzeit\",Hilfskonfig!F5,$C19+$AG19)","v":"09:00:00"},{"$f":"$AC19","v":0.625},{"$f":"IF(Zeitmodell=\"Vollzeit\",Hilfskonfig!G5,$C19+$AF19+AG19)","v":"14:00:00"},"16:00:00","18:00:00",{"$f":"$G19-$C19","v":"08:00:00"},{"$f":"\"< Von- und Bis-Normalarbeitszeit für \"&$A19&\" im Format [hh:mm] im weissen Feld eingeben\"&IF(OR(Zeitmodell=\"Vollzeit\",Zeitmodus<>\"Gleitzeit\"),\"\",CHAR(10)&\"< Von- und Bis-Kernzeit für \"&$A19&\" ändert sich automatisch auf ca. 75% der Normalarbeitszeit\")","v":"< Von- und Bis-Normalarbeitszeit für Mi im Format [hh:mm] im weissen Feld eingeben"},null,null,null,{"$f":"H19-B19","v":0.45833333333333331},{"$f":"G19-C19","v":0.33333333333333331},{"$f":"F19-D19","v":0.20833333333333337},{"$f":"AND(ISNUMBER($C19),ROUND($C19*24*4,0)/(24*4)=$C19,$C19>=$B19,$C19<=$H19)","v":true},{"$f":"AND(ISNUMBER($G19),ROUND($G19*24*4,0)/(24*4)=$G19,$G19>=$B19,$G19<=$H19)","v":true},{"$f":"AND(ISNUMBER($C19),ROUND($C19*24*4,0)/(24*4)=$C19,$C19>=$B19,$C19<=$D19)","v":true},{"$f":"AND(ISNUMBER($G19),ROUND($G19*24*4,0)/(24*4)=$G19,$G19>=$F19,$G19<=$H19)","v":true},{"$f":"IF(Zeitmodus=\"Gleitzeit\",IF(Zeitmodell=\"Teilzeit\",$Q19,$S19),AND(ISNUMBER($C19),$C19<=$G19))","v":true},{"$f":"IF(Zeitmodus=\"Gleitzeit\",IF(Zeitmodell=\"Teilzeit\",$R19,$T19),AND(ISNUMBER($C19),$C19<=$G19))","v":true},32,36,56,64,{"$f":"$Z19-$W19","v":32},{"$f":"($Y19-$X19)","v":20},{"$f":"IF($AA19=0,0,$AB19/$AA19)","v":0.625},{"$f":"ROUND(($AA19-$AB19)/2,0)/(24*4)","v":"01:30:00"},0.75,{"$f":"INT($AA19*$AE19)/(24*4)","v":"06:00:00"},"00:00:00",{"$f":"$C19<$D19","v":true},{"$f":"$G19>$F19","v":true},{"$f":"($G19-$C19)-($F19-$D19)","v":"03:00:00"},{"$f":"ROUND(($AJ19*24*4)/2,0)/(24*4)","v":"01:30:00"},{"$f":"$AK19+$AG19","v":"01:30:00"}]
["Do","07:00:00","08:00:00",{"$f":"IF(Zeitmodell=\"Vollzeit\",Hilfskonfig!F6,$C20+$AG20)","v":"09:00:00"},{"$f":"$AC20","v":0.625},{"$f":"IF(Zeitmodell=\"Vollzeit\",Hilfskonfig!G6,$C20+$AF20+AG20)","v":"14:00:00"},"16:00:00","18:00:00",{"$f":"$G20-$C20","v":"08:00:00"},{"$f":"\"< Von- und Bis-Normalarbeitszeit für \"&$A20&\" im Format [hh:mm] im weissen Feld eingeben\"&IF(OR(Zeitmodell=\"Vollzeit\",Zeitmodus<>\"Gleitzeit\"),\"\",CHAR(10)&\"< Von- und Bis-Kernzeit für \"&$A20&\" ändert sich automatisch auf ca. 75% der Normalarbeitszeit\")","v":"< Von- und Bis-Normalarbeitszeit für Do im Format [hh:mm] im weissen Feld eingeben"},null,null,null,{"$f":"H20-B20","v":0.45833333333333331},{"$f":"G20-C20","v":0.33333333333333331},{"$f":"F20-D20","v":0.20833333333333337},{"$f":"AND(ISNUMBER($C20),ROUND($C20*24*4,0)/(24*4)=$C20,$C20>=$B20,$C20<=$H20)","v":true},{"$f":"AND(ISNUMBER($G20),ROUND($G20*24*4,0)/(24*4)=$G20,$G20>=$B20,$G20<=$H20)","v":true},{"$f":"AND(ISNUMBER($C20),ROUND($C20*24*4,0)/(24*4)=$C20,$C20>=$B20,$C20<=$D20)","v":true},{"$f":"AND(ISNUMBER($G20),ROUND($G20*24*4,0)/(24*4)=$G20,$G20>=$F20,$G20<=$H20)","v":true},{"$f":"IF(Zeitmodus=\"Gleitzeit\",IF(Zeitmodell=\"Teilzeit\",$Q20,$S20),AND(ISNUMBER($C20),$C20<=$G20))","v":true},{"$f":"IF(Zeitmodus=\"Gleitzeit\",IF(Zeitmodell=\"Teilzeit\",$R20,$T20),AND(ISNUMBER($C20),$C20<=$G20))","v":true},32,36,56,64,{"$f":"$Z20-$W20","v":32},{"$f":"($Y20-$X20)","v":20},{"$f":"IF($AA20=0,0,$AB20/$AA20)","v":0.625},{"$f":"ROUND(($AA20-$AB20)/2,0)/(24*4)","v":"01:30:00"},0.75,{"$f":"INT($AA20*$AE20)/(24*4)","v":"06:00:00"},"00:00:00",{"$f":"$C20<$D20","v":true},{"$f":"$G20>$F20","v":true},{"$f":"($G20-$C20)-($F20-$D20)","v":"03:00:00"},{"$f":"ROUND(($AJ20*24*4)/2,0)/(24*4)","v":"01:30:00"},{"$f":"$AK20+$AG20","v":"01:30:00"}]
["Fr","07:00:00","08:00:00",{"$f":"IF(Zeitmodell=\"Vollzeit\",Hilfskonfig!F7,$C21+$AG21)","v":"09:00:00"},{"$f":"$AC21","v":0.375},{"$f":"IF(Zeitmodell=\"Vollzeit\",Hilfskonfig!G7,$C21+$AF21+AG21)","v":"12:00:00"},"16:00:00","18:00:00",{"$f":"$G21-$C21","v":"08:00:00"},{"$f":"\"< Von- und Bis-Normalarbeitszeit für \"&$A21&\" im Format [hh:mm] im weissen Feld eingeben\"&IF(OR(Zeitmodell=\"Vollzeit\",Zeitmodus<>\"Gleitzeit\"),\"\",CHAR(10)&\"< Von- und Bis-Kernzeit für \"&$A21&\" ändert sich automatisch auf ca. 75% der Normalarbeitszeit\")","v":"< Von- und Bis-Normalarbeitszeit für Fr im Format [hh:mm] im weissen Feld eingeben"},null,null,null,{"$f":"H21-B21","v":0.45833333333333331},{"$f":"G21-C21","v":0.33333333333333331},{"$f":"F21-D21","v":0.125},{"$f":"AND(ISNUMBER($C21),ROUND($C21*24*4,0)/(24*4)=$C21,$C21>=$B21,$C21<=$H21)","v":true},{"$f":"AND(ISNUMBER($G21),ROUND($G21*24*4,0)/(24*4)=$G21,$G21>=$B21,$G21<=$H21)","v":true},{"$f":"AND(ISNUMBER($C21),ROUND($C21*24*4,0)/(24*4)=$C21,$C21>=$B21,$C21<=$D21)","v":true},{"$f":"AND(ISNUMBER($G21),ROUND($G21*24*4,0)/(24*4)=$G21,$G21>=$F21,$G21<=$H21)","v":true},{"$f":"IF(Zeitmodus=\"Gleitzeit\",IF(Zeitmodell=\"Teilzeit\",$Q21,$S21),AND(ISNUMBER($C21),$C21<=$G21))","v":true},{"$f":"IF(Zeitmodus=\"Gleitzeit\",IF(Zeitmodell=\"Teilzeit\",$R21,$T21),AND(ISNUMBER($C21),$C21<=$G21))","v":true},32,36,48,64,{"$f":"$Z21-$W21","v":32},{"$f":"($Y21-$X21)","v":12},{"$f":"IF($AA21=0,0,$AB21/$AA21)","v":0.375},{"$f":"ROUND(($AA21-$AB21)/2,0)/(24*4)","v":"02:30:00"},0.75,{"$f":"INT($AA21*$AE21)/(24*4)","v":"06:00:00"},"00:00:00",{"$f":"$C21<$D21","v":true},{"$f":"$G21>$F21","v":true},{"$f":"($G21-$C21)-($F21-$D21)","v":"05:00:00"},{"$f":"ROUND(($AJ21*24*4)/2,0)/(24*4)","v":"02:30:00"},{"$f":"$AK21+$AG21","v":"02:30:00"}]
["Wochenarbeitszeit: ",null,null,null,null,null,null,null,{"$f":"SUM(I17:I21)","v":1.6666666666666665},"< Arbeitszeit pro Woche berechnet aus der Normalzeiteingabe von Mo.-Fr.",null,null,null,{"$f":"SUM(N17:N21)","v":2.2916666666666665},{"$f":"SUM(O17:O21)","v":1.6666666666666665},{"$f":"SUM(P17:P21)","v":0.95833333333333348},null,null,null,null,null,null,{"$f":"SUM(AA17:AA21)","v":160},{"$f":"SUM(AB17:AB21)","v":92},{"$f":"SUM(AC17:AC21)/5","v":0.57499999999999996},null,{"$f":"SUM(AE17:AE21)/5","v":0.75}]
["Arbeitszeitsaldo: ",null,null,null,null,null,null,null,{"$f":"IF(ISERROR(INDIRECT(Jahressaldo)),0,INDIRECT(Jahressaldo))","v":0},"< aktueller Stand des Arbeiszeitstunden-Saldos\n< dieser Wert wird < oder = -8 Std. und > oder = 24 Std. Rot hinterlegt"]

{"sheet":"Jänner","index":1,"n_rows":48,"n_cols":60,"rows_kept":48,"cut":false,"hidden":true,"merged":[[47,0,47,3],[47,11,47,15],[42,4,42,7],[42,10,42,15],[43,4,43,7],[44,4,44,7],[45,4,45,7],[46,4,46,7],[38,2,43,3],[38,4,38,7],[38,11,38,12],[38,14,38,15],[39,4,39,7],[39,14,39,15],[40,4,40,7],[40,14,40,15],[41,4,41,7],[41,10,41,15],[5,7,6,7],[5,10,6,10],[5,11,6,11],[5,12,6,12],[5,13,6,13],[5,27,5,32],[4,2,4,3],[4,4,4,5],[5,2,6,2],[5,3,6,3],[5,5,6,5],[5,6,6,6],[0,15,1,15],[1,5,1,7],[2,5,2,7],[3,0,3,3],[3,4,3,5],[3,6,4,8],[3,14,6,14],[3,15,6,15],[4,0,6,0],[4,1,6,1]]}
[" BOKU-Zeiterfassung für Allgemeines Personal",null,null,null,null,null,null,null,null,null,null,null,null,null,null,null,"Monat","Stunden-Saldo Grenzen","Status Blatteingabe"]
[{"$f":"\" Org.-Einh. : \"&OrgEinheit","v":" Org.-Einh. : HXXXXX"},null,null,null,null,"Zeitmodell:",null,null,{"$f":"\" \"&Zeitmodell","v":" Vollzeit"},"Modus:",{"$f":"\" \"&Zeitmodus","v":" Gleitzeit"},null,null,null,null,null,{"$f":"IF(ISNA($Q$4),1,$Q$4)","v":1},{"$f":"IF($Q$2=12,NormalOGDez,NormalOG)","v":71.999999999999986},{"$f":"SUM($BH8:$BH38)","v":0}]
[{"$f":" \" Mitarbeiter/in: \"&Name","v":" Mitarbeiter/in: Vorname Nachname"},null,null,null,null,"Vorgesetzte/r:",null,null,{"$f":"\" \"&Vorgesetzter","v":" Vorname Nachname"},null,null,null,null,null,null,null,{"$f":"RIGHT(CELL(\"filename\",A1),LEN(CELL(\"filename\",A1))-SEARCH(\"]\",CELL(\"filename\",A1),1))","v":"Jänner"},{"$f":"IF($Q$2=12,NormalUGDez,NormalUG)","v":-24},{"$f":"IF($Q$2=1,$S$2,$S$2+INDIRECT($S$5))","v":0}]
[{"$f":" \" Monat: \"&$Q$3&\" \"&Jahr","v":" Monat: Jänner 2023"},null,null,null,"Dienstplan",null,"Normalstunden Feiertag-ÜS1:2",null,null,"Übertrag","Überstundenberechnung",null,null,null," Unterschrift des\n Vorgesetzten","Anmerkungen \n(z.B. Überstunden- notwendigkeit)",{"$f":"IF(ISNA(VLOOKUP($Q$3,MTab,2,FALSE)),1,VLOOKUP($Q$3,MTab,2,FALSE))","v":1},null,"Übertrags Adresse Blatteingabe"]
[" Datum","Wochentag","Tagesinformationen",null,{"$f":"\"Wochen-AZ\"&\" \"&TEXT(WAZ,\"[hh]:mm\")","v":"Wochen-AZ 40:00"},null,null,null,null,{"$f":"IF(ISNA($Q$5),Übertrag,INDIRECT($Q$5))","v":0},"ÜS1:2",{"$f":"IF(Zeitmodell=\"Vollzeit\",\" Überstunden1:1,5\",\" Überstunden1:1,25\")","v":" Überstunden1:1,5"},null,null,null,null,{"$f":"IF(ISNA(VLOOKUP($Q$3,MTab,3,FALSE)),\"Übertrag\",VLOOKUP($Q$3,MTab,3,FALSE))","v":"Übertrag"},null,{"$f":"IF(ISNA(VLOOKUP($Q$3,MTab,4,FALSE)),$Q$3&\"!$S$2\",VLOOKUP($Q$3,MTab,4,FALSE))","v":"Jänner!$S$2"}]
[null,null," Feiertage\n Wochenende\n Urlaub, ZA, Krank","[U]rlaub\n[Z]A\n[ZK]\n[K]rank","Normal-","Soll","Von","Bis","Plus","Saldo","Plus","Von","Bis","Plus",null,null,"Hintergrundberechnungen",null,null,null,null,null,null,"Saldo aktuell",null,null,null,"GAZ-Tabellenabbildung",null,null,null,null,null,"Eingabebeprüfungen"]
[null,null,null,null,"Arbeitszeit",null,null,null,"Minus","akuell",null,null,null,null,null,null,"Datum","Monat OK","Abwesenh.","Freie Tage","ÜA-Tage","Std.","Soll-Std.",{"$f":"IF(ISNA($Q$5),Übertrag,INDIRECT($Q$5))","v":0},"Std.-Soll = 0","Std.-Soll > 0","Std.-Soll < 0",{"$f":"I_GAZGRVon","v":2},{"$f":"I_GAZNAZVon","v":3},{"$f":"I_GAZKVon","v":4},{"$f":"I_GAZKBis","v":6},{"$f":"I_GAZNAZBis","v":7},{"$f":"I_GAZGRBis","v":8},"Zeiteingabe","UZK-Eing.\nerlaubt","UZK-Eing.\ngültig","Normalst. ein erlaubt","Überstd. ein erlaubt","Normalstd.\neingegeben","Überstd.\neingegeben","Normal VON möglich OG","Normal VON möglich UG","Normal BIS möglich OG","Normal BIS möglich UG","Normal VON\n15min","Normal VON richtig","Normal BIS\n15min","Normal BIS richtig","ZA-Kern Von","ZA-Kern Bis","ZA-Kern","Über VON Obergrenze","Über VON Untergrenze","Über BIS Obergrenze","Über BIS Untergrenze","Über VON\n15min","Über VON richtig","Überl BIS\n15min","Über BIS richtig","Status Zeilen Eingabe"]
[{"$f":"IF($R8,$Q8,\"\")","v":"2023-01-01"},{"$f":"IF($R8,VLOOKUP(WEEKDAY($Q8,2),WOTA,2,FALSE),\"\")","v":"So"},{"$f":"IF($R8,\" \"&IF($S8=\"\",VLOOKUP($Q8,FListe,3,FALSE),$S8),\"\")","v":" Neujahrstag"},null,{"$f":"IF(AND($R8,$T8<>\"F\"),IF($AC8=$AF8,\"keine NAZ\",TEXT($AC8,\"hh:mm\")&\"-\"&TEXT($AF8,\"hh:mm\")),\"\")","v":""},{"$f":"IF($R8,IF($T8=\"F\",0,VLOOKUP($B8,GAZ,I_GAZNAZ,FALSE)),\"\")","v":"00:00:00"},null,null,{"$f":"IF(Zeitmodus=\"Gleitzeit\",IF($U8=\"F\",\"\",IF(AND($R8,$AM8,NOT($Y8)),ROUND(($V8-$F8)*24,2),IF($D8=\"Z\",$F8*-24,\"\"))),IF(OR($D8=\"Z\",AND($AM8,$U8=\"A\",W8<0)),ROUND($W8*24,2),\"\"))","v":""},{"$f":"IF($R8,$X8,\"\")","v":0},{"$f":"IF(AND($U8=\"F\",$AM8),ROUND($V8*24,2),\"\")","v":""},null,null,{"$f":"IF(Zeitmodus=\"Gleitzeit\",IF(AND($R8,$AN8,$M8-$L8<>0,$AL8),ROUND(($M8-$L8)*24,2),\"\"),IF(AND($AM8,$U8=\"A\",W8>0),ROUND(W8*24,2),\"\"))","v":""},null,null,{"$f":"DATE(Jahr,$Q2,1)","v":"2023-01-01"},{"$f":"$Q$2=MONTH($Q8)","v":true},{"$f":"IF(OR($D8=\"U\",$D8=\"Z\",$D8=\"ZK\",$D8=\"K\"),VLOOKUP($D8,UZK,2,FALSE),\"\")","v":""},{"$f":"IF($R8,VLOOKUP($Q8,FListe,4,FALSE),\"\")","v":"F"},{"$f":"IF($R8,VLOOKUP($Q8,FListe,5,FALSE),\"\")","v":"F"},{"$f":"$H8-$G8","v":0},{"$f":"IF($R8,ROUND($V8-$F8,15),\"\")","v":0},{"$f":"IF($I8<>\"\",$X7+$I8,$X7)","v":0},{"$f":"($W8=0)","v":true},{"$f":"($W8>0)","v":false},{"$f":"($W8<0)","v":false},{"$f":"IF(ISNA(VLOOKUP($B8,GAZ,AB$7,FALSE)),\"\",VLOOKUP($B8,GAZ,AB$7,FALSE))","v":""},"",{"$f":"IF(ISNA(VLOOKUP($B8,GAZ,AD$7,FALSE)),\"\",IF($AC8=$AF8,$G8,VLOOKUP($B8,GAZ,AD$7,FALSE)))","v":""},{"$f":"IF(ISNA(VLOOKUP($B8,GAZ,AE$7,FALSE)),\"\",IF($AC8=$AF8,$H8,VLOOKUP($B8,GAZ,AE$7,FALSE)))","v":""},"","",{"$f":"OR($G8<>\"\",$H8<>\"\",$L8<>\"\",$M8<>\"\")","v":false},{"$f":"AND($T8<>\"F\",NOT($AH8),NOT($AC8=$AF8))","v":false},{"$f":"AND($AI8,OR($D8=\"U\",$D8=\"Z\",$D8=\"K\"))","v":false},{"$f":"AND($D8<>\"U\",$D8<>\"Z\",$D8<>\"K\",$R8)","v":true},{"$f":"AND(Zeitmodus=C_Gleitzeit,$U8<>\"F\",OR($B8=\"Sa\",AND($AM8,$I8>=0,NOT($AY8))))","v":false},{"$f":"AND($G8<>\"\",$H8<>\"\")","v":false},{"$f":"OR($K8<>\"\",AND($L8<>\"\",$M8<>\"\"))","v":false},{"$f":"IF($AK8,TagUG,\"\")","v":"00:00:00"},{"$f":"IF($AK8,IF($H8=\"\",IF(AND($L8<>\"\",$L8<$AG8),$L8,IF(AND($M8<>\"\",$M8<$AG8),$M8,TagOG)),$H8),\"\")","v":"23:59:00"},{"$f":"IF($AK8,IF($G8=\"\",$AB8,$G8),\"\")","v":""},{"$f":"IF($AK8,IF(AND($L8<>\"\",$L8<$AG8),$L8,IF(AND($M8<>\"\",$M8<$AG8),$M8,TagOG)),\"\")","v":"23:59:00"},{"$f":"MOD($G8*24,0.25)=0","v":true},{"$f":"AND($AK8,ISNUMBER($G8),$G8>=$AO8,$G8<=$AP8)","v":false},{"$f":"MOD($H8*24,0.25)=0","v":true},{"$f":"AND($AK8,ISNUMBER($H8),$H8>=$AQ8,$H8<=$AR8)","v":false},{"$f":"AND(Zeitmodus=C_Gleitzeit,$B8<>\"Sa\",$G8<>\"\",$G8>$AD8)","v":false},{"$f":"AND(Zeitmodus=C_Gleitzeit,$B8<>\"Sa\",$H8<>\"\",$H8<$AE8)","v":false},{"$f":"AND($U8<>\"F\",OR($AW8,$AX8))","v":false},{"$f":"IF($B8=\"Sa\",IF($H8<>\"\",$H8,TIME(0,0,0)),IF($AL8,IF(AND($H8<>\"\",$H8>$AF8),$H8,$AF8),\"\"))","v":""},{"$f":"IF($AL8,IF($M8<>\"\",$M8,$BC8),\"\")","v":""},{"$f":"IF($B8=\"Sa\",IF($L8=\"\",TIME(0,0,0),$L8),IF($AL8,IF($L8<>\"\",$L8,IF(AND($H8<>\"\",$H8>$AF8),$H8,$AF8)),\"\"))","v":""},{"$f":"IF($AL8,TIME(23,59,0),\"\")","v":""},{"$f":"MOD($L8*24,0.25)=0","v":true},{"$f":"AND($AL8,ISNUMBER($L8),$L8>=$AZ8,$BA8>=$L8)","v":false},{"$f":"MOD($M8*24,0.25)=0","v":true},{"$f":"AND($AL8,ISNUMBER($M8),$M8>=$BB8,$M8<=$BC8)","v":false},{"$f":"IF(AND(ISBLANK($D8),ISBLANK($G8),ISBLANK($H8),ISBLANK($L8),ISBLANK($M8),ISBLANK($P8)),0,1)","v":0}]
[{"$f":"IF($R9,$Q9,\"\")","v":"2023-01-02"},"Mo"," ",null,{"$f":"IF(AND($R9,$T9<>\"F\"),IF($AC9=$AF9,\"keine NAZ\",TEXT($AC9,\"hh:mm\")&\"-\"&TEXT($AF9,\"hh:mm\")),\"\")","v":"08:00-16:00"},"08:00:00",null,null,"",0,{"$f":"IF(AND($U9=\"F\",$AM9),ROUND($V9*24,2),\"\")","v":""},null,null,"",null,null,{"$f":" Q8+1","v":"2023-01-02"},true,"","A","A",0,-0.33333333333333298,0,false,false,true,"07:00:00","08:00:00","09:00:00","14:00:00","16:00:00","18:00:00",false,{"$f":"AND($T9<>\"F\",NOT($AH9),NOT($AC9=$AF9))","v":true},false,true,{"$f":"AND(Zeitmodus=C_Gleitzeit,$U9<>\"F\",OR($B9=\"Sa\",AND($AM9,$I9>=0,NOT($AY9))))","v":false},false,{"$f":"OR($K9<>\"\",AND($L9<>\"\",$M9<>\"\"))","v":false},"00:00:00","23:59:00",{"$f":"IF($AK9,IF($G9=\"\",TagUG,$G9),\"\")","v":"00:00:00"},"23:59:00",true,false,true,false,false,false,{"$f":"AND($U9<>\"F\",OR($AW9,$AX9))","v":false},"","","","",true,false,true,false,0]
["2023-01-03","Di"," ",null,"08:00-16:00","08:00:00",null,null,"",0,"",null,null,"",null,null,"2023-01-03",true,"","A","A",0,-0.33333333333333298,0,false,false,true,"07:00:00","08:00:00","09:00:00","14:00:00","16:00:00","18:00:00",false,true,false,true,false,false,false,"00:00:00","23:59:00","00:00:00","23:59:00",true,false,true,false,false,false,false,"","","","",true,false,true,false,0]
["2023-01-04","Mi"," ",null,"08:00-16:00","08:00:00",null,null,"",0,"",null,null,"",null,null,"2023-01-04",true,"","A","A",0,-0.33333333333333298,0,false,false,true,"07:00:00","08:00:00","09:00:00","14:00:00","16:00:00","18:00:00",false,true,false,true,false,false,false,"00:00:00","23:59:00","00:00:00","23:59:00",true,false,true,false,false,false,false,"","","","",true,false,true,false,0]
["2023-01-05","Do"," ",null,"08:00-16:00","08:00:00",null,null,"",0,"",null,null,"",null,null,"2023-01-05",true,"","A","A",0,-0.33333333333333298,0,false,false,true,"07:00:00","08:00:00","09:00:00","14:00:00","16:00:00","18:00:00",false,true,false,true,false,false,false,"00:00:00","23:59:00","00:00:00","23:59:00",true,false,true,false,false,false,false,"","","","",true,false,true,false,0]
["2023-01-06","Fr"," Hl. drei Könige",null,"","00:00:00",null,null,"",0,"",null,null,"",null,null,"2023-01-06",true,"","F","F",0,0,0,true,false,false,"07:00:00","08:00:00","09:00:00","12:00:00","16:00:00","18:00:00",false,false,false,true,false,false,false,"00:00:00","23:59:00","00:00:00","23:59:00",true,false,true,false,false,false,false,"","","","",true,false,true,false,0]
["2023-01-07","Sa"," Wochenende",null,"","00:00:00",null,null,"",0,"",null,null,"",null,null,"2023-01-07",true,"","F","A",0,0,0,true,false,false,"","","","","","",false,false,false,true,true,false,false,"00:00:00","23:59:00","00:00:00","23:59:00",true,false,true,false,false,false,false,"00:00:00","23:59:00","00:00:00","23:59:00",true,false,true,false,0]
["2023-01-08","So"," Wochenende",null,"","00:00:00",null,null,"",0,"",null,null,"",null,null,"2023-01-08",true,"","F","F",0,0,0,true,false,false,"","","","","","",false,false,false,true,false,false,false,"00:00:00","23:59:00","00:00:00","23:59:00",true,false,true,false,false,false,false,"","","","",true,false,true,false,0]
["2023-01-09","Mo"," ",null,"08:00-16:00","08:00:00",null,null,"",0,"",null,null,"",null,null,"2023-01-09",true,"","A","A",0,-0.33333333333333298,0,false,false,true,"07:00:00","08:00:00","09:00:00","14:00:00","16:00:00","18:00:00",false,true,false,true,false,false,false,"00:00:00","23:59:00","00:00:00","23:59:00",true,false,true,false,false,false,false,"","","","",true,false,true,false,0]
["2023-01-10","Di"," ",null,"08:00-16:00","08:00:00",null,null,"",0,"",null,null,"",null,null,"2023-01-10",true,"","A","A",0,-0.33333333333333298,0,false,false,true,"07:00:00","08:00:00","09:00:00","14:00:00","16:00:00","18:00:00",false,true,false,true,false,false,false,"00:00:00","23:59:00","00:00:00","23:59:00",true,false,true,false,false,false,false,"","","","",true,false,true,false,0]
["2023-01-11","Mi"," ",null,"08:00-16:00","08:00:00",null,null,"",0,"",null,null,"",null,null,"2023-01-11",true,"","A","A",0,-0.33333333333333298,0,false,false,true,"07:00:00","08:00:00","09:00:00","14:00:00","16:00:00","18:00:00",false,true,false,true,false,false,false,"00:00:00","23:59:00","00:00:00","23:59:00",true,false,true,false,false,false,false,"","","","",true,false,true,false,0]
["2023-01-12","Do"," ",null,"08:00-16:00","08:00:00",null,null,"",0,"",null,null,"",null,null,"2023-01-12",true,"","A","A",0,-0.33333333333333298,0,false,false,true,"07:00:00","08:00:00","09:00:00","14:00:00","16:00:00","18:00:00",false,true,false,true,false,false,false,"00:00:00","23:59:00","00:00:00","23:59:00",true,false,true,false,false,false,false,"","","","",true,false,true,false,0]
["2023-01-13","Fr"," ",null,"08:00-16:00","08:00:00",null,null,"",0,"",null,null,"",null,null,"2023-01-13",true,"","A","A",0,-0.33333333333333298,0,false,false,true,"07:00:00","08:00:00","09:00:00","12:00:00","16:00:00","18:00:00",false,true,false,true,false,false,false,"00:00:00","23:59:00","00:00:00","23:59:00",true,false,true,false,false,false,false,"","","","",true,false,true,false,0]
["2023-01-14","Sa"," Wochenende",null,"","00:00:00",null,null,"",0,"",null,null,"",null,null,"2023-01-14",true,"","F","A",0,0,0,true,false,false,"","","","","","",false,false,false,true,true,false,false,"00:00:00","23:59:00","00:00:00","23:59:00",true,false,true,false,false,false,false,"00:00:00","23:59:00","00:00:00","23:59:00",true,false,true,false,0]
["2023-01-15","So"," Wochenende",null,"","00:00:00",null,null,"",0,"",null,null,"",null,null,"2023-01-15",true,"","F","F",0,0,0,true,false,false,"","","","","","",false,false,false,true,false,false,false,"00:00:00","23:59:00","00:00:00","23:59:00",true,false,true,false,false,false,false,"","","","",true,false,true,false,0]
["2023-01-16","Mo"," ",null,"08:00-16:00","08:00:00",null,null,"",0,"",null,null,"",null,null,"2023-01-16",true,"","A","A",0,-0.33333333333333298,0,false,false,true,"07:00:00","08:00:00","09:00:00","14:00:00","16:00:00","18:00:00",false,true,false,true,false,false,false,"00:00:00","23:59:00","00:00:00","23:59:00",true,false,true,false,false,false,false,"","","","",true,false,true,false,0]
["2023-01-17","Di"," ",null,"08:00-16:00","08:00:00",null,null,"",0,"",null,null,"",null,null,"2023-01-17",true,"","A","A",0,-0.33333333333333298,0,false,false,true,{"$f":"IF(ISNA(VLOOKUP($B24,GAZ,AB$7,FALSE)),\"\",VLOOKUP($B24,GAZ,AB$7,FALSE))","v":"07:00:00"},"08:00:00","09:00:00","14:00:00","16:00:00","18:00:00",false,true,false,true,false,false,false,"00:00:00","23:59:00","00:00:00","23:59:00",true,false,true,false,false,false,false,"","","","",true,false,true,false,0]
["2023-01-18","Mi"," ",null,"08:00-16:00","08:00:00",null,null,"",0,"",null,null,"",null,null,"2023-01-18",true,"","A","A",0,-0.33333333333333298,0,false,false,true,"07:00:00","08:00:00","09:00:00","14:00:00","16:00:00","18:00:00",false,true,false,true,false,false,false,"00:00:00","23:59:00","00:00:00","23:59:00",true,false,true,false,false,false,false,"","","","",true,false,true,false,0]
["2023-01-19","Do"," ",null,"08:00-16:00","08:00:00",null,null,"",0,"",null,null,"",null,null,"2023-01-19",true,"","A","A",0,-0.33333333333333298,0,false,false,true,"07:00:00","08:00:00","09:00:00","14:00:00","16:00:00","18:00:00",false,true,false,true,false,false,false,"00:00:00","23:59:00","00:00:00","23:59:00",true,false,true,false,false,false,false,"","","","",true,false,true,false,0]
["2023-01-20","Fr"," ",null,"08:00-16:00","08:00:00",null,null,"",0,"",null,null,"",null,null,"2023-01-20",true,"","A","A",0,-0.33333333333333298,0,false,false,true,"07:00:00","08:00:00","09:00:00","12:00:00","16:00:00","18:00:00",false,true,false,true,false,false,false,"00:00:00","23:59:00","00:00:00","23:59:00",true,false,true,false,false,false,false,"","","","",true,false,true,false,0]
["2023-01-21","Sa"," Wochenende",null,"","00:00:00",null,null,"",0,"",null,null,"",null,null,"2023-01-21",true,"","F","A",0,0,0,true,false,false,"","","","","","",false,false,false,true,true,false,false,"00:00:00","23:59:00","00:00:00","23:59:00",true,false,true,false,false,false,false,"00:00:00","23:59:00","00:00:00","23:59:00",true,false,true,false,0]
["2023-01-22","So"," Wochenende",null,"","00:00:00",null,null,"",0,"",null,null,"",null,null,"2023-01-22",true,"","F","F",0,0,0,true,false,false,"","","","","","",false,false,false,true,false,false,false,"00:00:00","23:59:00","00:00:00","23:59:00",true,false,true,false,false,false,false,"","","","",true,false,true,false,0]
["2023-01-23","Mo"," ",null,"08:00-16:00","08:00:00",null,null,"",0,"",null,null,"",null,null,"2023-01-23",true,"","A","A",0,-0.33333333333333298,0,false,false,true,"07:00:00","08:00:00","09:00:00","14:00:00","16:00:00","18:00:00",false,true,false,true,false,false,false,"00:00:00","23:59:00","00:00:00","23:59:00",true,false,true,false,false,false,false,"","","","",true,false,true,false,0]
["2023-01-24","Di"," ",null,"08:00-16:00","08:00:00",null,null,"",0,"",null,null,"",null,null,"2023-01-24",true,"","A","A",0,-0.33333333333333298,0,false,false,true,"07:00:00","08:00:00","09:00:00","14:00:00","16:00:00","18:00:00",false,true,false,true,false,false,false,"00:00:00","23:59:00","00:00:00","23:59:00",true,false,true,false,false,false,false,"","","","",true,false,true,false,0]
["2023-01-25","Mi"," ",null,"08:00-16:00","08:00:00",null,null,"",0,"",null,null,"",null,null,"2023-01-25",true,"","A","A",0,-0.33333333333333298,0,false,false,true,"07:00:00","08:00:00","09:00:00","14:00:00","16:00:00","18:00:00",false,true,false,true,false,false,false,"00:00:00","23:59:00","00:00:00","23:59:00",true,false,true,false,false,false,false,"","","","",true,false,true,false,0]
["2023-01-26","Do"," ",null,"08:00-16:00","08:00:00",null,null,"",0,"",null,null,"",null,null,"2023-01-26",true,"","A","A",0,-0.33333333333333298,0,false,false,true,"07:00:00","08:00:00","09:00:00","14:00:00","16:00:00","18:00:00",false,true,false,true,false,false,false,"00:00:00","23:59:00","00:00:00","23:59:00",true,false,true,false,false,false,false,"","","","",true,false,true,false,0]
["2023-01-27","Fr"," ",null,"08:00-16:00","08:00:00",null,null,"",0,"",null,null,"",null,null,"2023-01-27",true,"","A","A",0,-0.33333333333333298,0,false,false,true,"07:00:00","08:00:00","09:00:00","12:00:00","16:00:00","18:00:00",false,true,false,true,false,false,false,"00:00:00","23:59:00","00:00:00","23:59:00",true,false,true,false,false,false,false,"","","","",true,false,true,false,0]
["2023-01-28","Sa"," Wochenende",null,"","00:00:00",null,null,"",0,"",null,null,"",null,null,"2023-01-28",true,"","F","A",0,0,0,true,false,false,"","","","","","",false,false,false,true,true,false,false,"00:00:00","23:59:00","00:00:00","23:59:00",true,false,true,false,false,false,false,"00:00:00","23:59:00","00:00:00","23:59:00",true,false,true,false,0]
["2023-01-29","So"," Wochenende",null,"","00:00:00",null,null,"",0,"",null,null,"",null,null,"2023-01-29",true,"","F","F",0,0,0,true,false,false,"","","","","","",false,false,false,true,false,false,false,"00:00:00","23:59:00","00:00:00","23:59:00",true,false,true,false,false,false,false,"","","","",true,false,true,false,0]
["2023-01-30","Mo"," ",null,"08:00-16:00","08:00:00",null,null,"",0,"",null,null,"",null,null,"2023-01-30",true,"","A","A",0,-0.33333333333333298,0,false,false,true,"07:00:00","08:00:00","09:00:00","14:00:00","16:00:00","18:00:00",false,true,false,true,false,false,false,"00:00:00","23:59:00","00:00:00","23:59:00",true,false,true,false,false,false,false,"","","","",true,false,true,false,0]
["2023-01-31","Di"," ",null,"08:00-16:00","08:00:00",null,null,"",{"$f":"IF($R38,$X38,\"\")","v":0},"",null,null,"",null,null,"2023-01-31",true,"","A","A",0,-0.33333333333333298,0,false,false,true,"07:00:00","08:00:00","09:00:00","14:00:00","16:00:00","18:00:00",false,true,false,true,false,false,false,"00:00:00","23:59:00","00:00:00","23:59:00",true,false,true,false,false,false,false,"","","","",true,false,true,false,0]
["Arbeitstage",{"$f":"COUNTIF(T$8:T$38,\"A\")","v":21},null,null,{"$f":"\"Saldo Monat (~15min) > \"","v":"Saldo Monat (~15min) > "},null,null,null,{"$f":"ROUND(SUM(I8:I38)*4,0)/4","v":0},null,{"$f":"SUM(K8:K38)","v":0}," < ÜS1:2",null,{"$f":"SUM(N8:N38)","v":0},{"$f":"IF(Zeitmodell=\"Vollzeit\",\" < ÜS1:1,5 \",\" < ÜS1:1,25 \")&Zeitmodell","v":" < ÜS1:1,5 Vollzeit"},null,"Zeitmodell Text"]
["Freie Tage",{"$f":"COUNTIF(T$8:T$38,\"F\")","v":10},null,null,{"$f":"\"Saldo \"&IF(Zeitmodell=\"Vollzeit\",\"1:1,5\",\"1:1,25\")& \" (~15min) > \"","v":"Saldo 1:1,5 (~15min) > "},null,null,null,{"$f":"ROUND($N40*4,0)/4","v":0},null,null,null,null,{"$f":"IF(Zeitmodell=\"Vollzeit\",$N39*1.5,$N39*1.25)","v":0},{"$f":"IF(Zeitmodell=\"Vollzeit\",\" < 1:1,5 \",\" < 1:1,25 \")&$Q40","v":" < 1:1,5 Stunden berechnen"},null,"Stunden berechnen"]
["ZK-Tage",0,null,null,"Saldo 1:2 (~15min) > ",null,null,null,{"$f":"ROUND($N41*4,0)/4","v":0},null,null,null,null,{"$f":"K39*2","v":0}," < 1:2    Stunden berechnen"]
["ZA-Tage",{"$f":"COUNTIF(D$8:D$38,\"Z\")","v":0},null,null," Saldo Vormonat > ",null,null,null,{"$f":"$J5","v":0},null,null,null,null,null,null,null,"Gültigkeit ausbezahlt"]
["Urlaubstage",{"$f":"COUNTIF(D$8:D$38,\"U\")","v":0},null,null," Saldo Gesamt > ",null,null,null,{"$f":"SUM(I39:I42)","v":0},null,{"$f":"IF($I$43>=$R$2,\"< Hier ausbezahlte Std. eingeben. (Die Eingabe ist hier erst ab   < einem Saldo von \"&TEXT($R$2,\"#.##0,00\")&\" Std., und nur in 0,25-Schritten möglich.)\",\"\")","v":""},null,null,null,null,null,{"$f":"IF(AND($J$43<>\"\",NOT(ISNUMBER($J$43))),FALSE,OR(AND($J$43>=0,$J$43<=$I$43,MOD($J$43,0.25)=0),$J$43=\"\"))","v":true}]
["Krank",{"$f":"COUNTIF(D$8:D$38,\"K\")","v":0},null,null," Saldo Übertrag > ",null,null,null,{"$f":"$I43-$J43","v":0},{"$f":"\" < Dieser Stunden-Saldo wird in das nächste \"&IF($Q$3=\"Dezember\",\"Jahr\",\"Monat\")&\" übertragen\"","v":" < Dieser Stunden-Saldo wird in das nächste Monat übertragen"}]
[null,null,null,"Z"]
[]
[]
[{"$f":"\"Unterschrift von \"&Vorgesetzter","v":"Unterschrift von Vorname Nachname"},null,null,null,null,null,null,null,null,null,null,{"$f":"\"Unterschrift von \"&Name","v":"Unterschrift von Vorname Nachname"}]

{"sheet":"Februar","index":2,"n_rows":48,"n_cols":60,"rows_kept":48,"cut":false,"hidden":true,"merged":[[47,0,47,3],[47,11,47,15],[42,4,42,7],[42,10,42,15],[43,4,43,7],[44,4,44,7],[45,4,45,7],[46,4,46,7],[38,2,43,3],[38,4,38,7],[38,11,38,12],[38,14,38,15],[39,4,39,7],[39,14,39,15],[40,4,40,7],[40,14,40,15],[41,4,41,7],[41,10,41,15],[5,7,6,7],[5,10,6,10],[5,11,6,11],[5,12,6,12],[5,13,6,13],[5,27,5,32],[4,2,4,3],[4,4,4,5],[5,2,6,2],[5,3,6,3],[5,5,6,5],[5,6,6,6],[0,15,1,15],[1,5,1,7],[2,5,2,7],[3,0,3,3],[3,4,3,5],[3,6,4,8],[3,14,6,14],[3,15,6,15],[4,0,6,0],[4,1,6,1]]}
[" BOKU-Zeiterfassung für Allgemeines Personal",null,null,null,null,null,null,null,null,null,null,null,null,null,null,null,"Monat","Stunden-Saldo Grenzen","Status Blatteingabe"]
[{"$f":"\" Org.-Einh. : \"&OrgEinheit","v":" Org.-Einh. : HXXXXX"},null,null,null,null,"Zeitmodell:",null,null,{"$f":"\" \"&Zeitmodell","v":" Vollzeit"},"Modus:",{"$f":"\" \"&Zeitmodus","v":" Gleitzeit"},null,null,null,null,null,{"$f":"IF(ISNA($Q$4),1,$Q$4)","v":2},{"$f":"IF($Q$2=12,NormalOGDez,NormalOG)","v":71.999999999999986},{"$f":"SUM($BH8:$BH38)","v":0}]
[{"$f":" \" Mitarbeiter/in: \"&Name","v":" Mitarbeiter/in: Vorname Nachname"},null,null,null,null,"Vorgesetzte/r:",null,null,{"$f":"\" \"&Vorgesetzter","v":" Vorname Nachname"},null,null,null,null,null,null,null,{"$f":"RIGHT(CELL(\"filename\",A1),LEN(CELL(\"filename\",A1))-SEARCH(\"]\",CELL(\"filename\",A1),1))","v":"Februar"},{"$f":"IF($Q$2=12,NormalUGDez,NormalUG)","v":-24},{"$f":"IF($Q$2=1,$S$2,$S$2+INDIRECT($S$5))","v":0}]
[{"$f":" \" Monat: \"&$Q$3&\" \"&Jahr","v":" Monat: Februar 2023"},null,null,null,"Dienstplan",null,"Normalstunden Feiertag-ÜS1:2",null,null,"Übertrag","Überstundenberechnung",null,null,null," Unterschrift des\n Vorgesetzten","Anmerkungen \n(z.B. Überstunden- notwendigkeit)",{"$f":"IF(ISNA(VLOOKUP($Q$3,MTab,2,FALSE)),1,VLOOKUP($Q$3,MTab,2,FALSE))","v":2},null,"Übertrags Adresse Blatteingabe"]
[" Datum","Wochentag","Tagesinformationen",null,{"$f":"\"Wochen-AZ\"&\" \"&TEXT(WAZ,\"[hh]:mm\")","v":"Wochen-AZ 40:00"},null,null,null,null,{"$f":"IF(ISNA($Q$5),Übertrag,INDIRECT($Q$5))","v":0},"ÜS1:2",{"$f":"IF(Zeitmodell=\"Vollzeit\",\" Überstunden1:1,5\",\" Überstunden1:1,25\")","v":" Überstunden1:1,5"},null,null,null,null,{"$f":"IF(ISNA(VLOOKUP($Q$3,MTab,3,FALSE)),\"Übertrag\",VLOOKUP($Q$3,MTab,3,FALSE))","v":"Jänner!$I$44"},null,{"$f":"IF(ISNA(VLOOKUP($Q$3,MTab,4,FALSE)),$Q$3&\"!$S$2\",VLOOKUP($Q$3,MTab,4,FALSE))","v":"Jänner!$S$3"}]
[null,null," Feiertage\n Wochenende\n Urlaub, ZA, Krank","[U]rlaub\n[Z]A\n[ZK]\n[K]rank","Normal-","Soll","Von","Bis","Plus","Saldo","Plus","Von","Bis","Plus",null,null,"Hintergrundberechnungen",null,null,null,null,null,null,"Saldo aktuell",null,null,null,"GAZ-Tabellenabbildung",null,null,null,null,null,"Eingabebeprüfungen"]
[null,null,null,null,"Arbeitszeit",null,null,null,"Minus","akuell",null,null,null,null,null,null,"Datum","Monat OK","Abwesenh.","Freie Tage","ÜA-Tage","Std.","Soll-Std.",{"$f":"IF(ISNA($Q$5),Übertrag,INDIRECT($Q$5))","v":0},"Std.-Soll = 0","Std.-Soll > 0","Std.-Soll < 0",{"$f":"I_GAZGRVon","v":2},{"$f":"I_GAZNAZVon","v":3},{"$f":"I_GAZKVon","v":4},{"$f":"I_GAZKBis","v":6},{"$f":"I_GAZNAZBis","v":7},{"$f":"I_GAZGRBis","v":8},"Zeiteingabe","UZK-Eing.\nerlaubt","UZK-Eing.\ngültig","Normalst. ein erlaubt","Überstd. ein erlaubt","Normalstd.\neingegeben","Überstd.\neingegeben","Normal VON möglich OG","Normal VON möglich UG","Normal BIS möglich OG","Normal BIS möglich UG","Normal VON\n15min","Normal VON richtig","Normal BIS\n15min","Normal BIS richtig","ZA-Kern Von","ZA-Kern Bis","ZA-Kern","Über VON Obergrenze","Über VON Untergrenze","Über BIS Obergrenze","Über BIS Untergrenze","Über VON\n15min","Über VON richtig","Überl BIS\n15min","Über BIS richtig","Status Zeilen Eingabe"]
[{"$f":"IF($R8,$Q8,\"\")","v":"2023-02-01"},{"$f":"IF($R8,VLOOKUP(WEEKDAY($Q8,2),WOTA,2,FALSE),\"\")","v":"Mi"},{"$f":"IF($R8,\" \"&IF($S8=\"\",VLOOKUP($Q8,FListe,3,FALSE),$S8),\"\")","v":" "},null,{"$f":"IF(AND($R8,$T8<>\"F\"),IF($AC8=$AF8,\"keine NAZ\",TEXT($AC8,\"hh:mm\")&\"-\"&TEXT($AF8,\"hh:mm\")),\"\")","v":"08:00-16:00"},{"$f":"IF($R8,IF($T8=\"F\",0,VLOOKUP($B8,GAZ,I_GAZNAZ,FALSE)),\"\")","v":"08:00:00"},null,null,{"$f":"IF(Zeitmodus=\"Gleitzeit\",IF($U8=\"F\",\"\",IF(AND($R8,$AM8,NOT($Y8)),ROUND(($V8-$F8)*24,2),IF($D8=\"Z\",$F8*-24,\"\"))),IF(OR($D8=\"Z\",AND($AM8,$U8=\"A\",W8<0)),ROUND($W8*24,2),\"\"))","v":""},{"$f":"IF($R8,$X8,\"\")","v":0},{"$f":"IF(AND($U8=\"F\",$AM8),ROUND($V8*24,2),\"\")","v":""},null,null,{"$f":"IF(Zeitmodus=\"Gleitzeit\",IF(AND($R8,$AN8,$M8-$L8<>0,$AL8),ROUND(($M8-$L8)*24,2),\"\"),IF(AND($AM8,$U8=\"A\",W8>0),ROUND(W8*24,2),\"\"))","v":""},null,null,{"$f":"DATE(Jahr,$Q2,1)","v":"2023-02-01"},{"$f":"$Q$2=MONTH($Q8)","v":true},{"$f":"IF(OR($D8=\"U\",$D8=\"Z\",$D8=\"ZK\",$D8=\"K\"),VLOOKUP($D8,UZK,2,FALSE),\"\")","v":""},{"$f":"IF($R8,VLOOKUP($Q8,FListe,4,FALSE),\"\")","v":"A"},{"$f":"IF($R8,VLOOKUP($Q8,FListe,5,FALSE),\"\")","v":"A"},{"$f":"$H8-$G8","v":0},{"$f":"IF($R8,ROUND($V8-$F8,15),\"\")","v":-0.33333333333333298},{"$f":"IF($I8<>\"\",$X7+$I8,$X7)","v":0},{"$f":"($W8=0)","v":false},{"$f":"($W8>0)","v":false},{"$f":"($W8<0)","v":true},{"$f":"IF(ISNA(VLOOKUP($B8,GAZ,AB$7,FALSE)),\"\",VLOOKUP($B8,GAZ,AB$7,FALSE))","v":"07:00:00"},"08:00:00",{"$f":"IF(ISNA(VLOOKUP($B8,GAZ,AD$7,FALSE)),\"\",IF($AC8=$AF8,$G8,VLOOKUP($B8,GAZ,AD$7,FALSE)))","v":"09:00:00"},{"$f":"IF(ISNA(VLOOKUP($B8,GAZ,AE$7,FALSE)),\"\",IF($AC8=$AF8,$H8,VLOOKUP($B8,GAZ,AE$7,FALSE)))","v":"14:00:00"},"16:00:00","18:00:00",{"$f":"OR($G8<>\"\",$H8<>\"\",$L8<>\"\",$M8<>\"\")","v":false},{"$f":"AND($T8<>\"F\",NOT($AH8),NOT($AC8=$AF8))","v":true},{"$f":"AND($AI8,OR($D8=\"U\",$D8=\"Z\",$D8=\"K\"))","v":false},{"$f":"AND($D8<>\"U\",$D8<>\"Z\",$D8<>\"K\",$R8)","v":true},{"$f":"AND(Zeitmodus=C_Gleitzeit,$U8<>\"F\",OR($B8=\"Sa\",AND($AM8,$I8>=0,NOT($AY8))))","v":false},{"$f":"AND($G8<>\"\",$H8<>\"\")","v":false},{"$f":"OR($K8<>\"\",AND($L8<>\"\",$M8<>\"\"))","v":false},{"$f":"IF($AK8,TagUG,\"\")","v":"00:00:00"},{"$f":"IF($AK8,IF($H8=\"\",IF(AND($L8<>\"\",$L8<$AG8),$L8,IF(AND($M8<>\"\",$M8<$AG8),$M8,TagOG)),$H8),\"\")","v":"23:59:00"},{"$f":"IF($AK8,IF($G8=\"\",$AB8,$G8),\"\")","v":"07:00:00"},{"$f":"IF($AK8,IF(AND($L8<>\"\",$L8<$AG8),$L8,IF(AND($M8<>\"\",$M8<$AG8),$M8,TagOG)),\"\")","v":"23:59:00"},{"$f":"MOD($G8*24,0.25)=0","v":true},{"$f":"AND($AK8,ISNUMBER($G8),$G8>=$AO8,$G8<=$AP8)","v":false},{"$f":"MOD($H8*24,0.25)=0","v":true},{"$f":"AND($AK8,ISNUMBER($H8),$H8>=$AQ8,$H8<=$AR8)","v":false},{"$f":"AND(Zeitmodus=C_Gleitzeit,$B8<>\"Sa\",$G8<>\"\",$G8>$AD8)","v":false},{"$f":"AND(Zeitmodus=C_Gleitzeit,$B8<>\"Sa\",$H8<>\"\",$H8<$AE8)","v":false},{"$f":"AND($U8<>\"F\",OR($AW8,$AX8))","v":false},{"$f":"IF($B8=\"Sa\",IF($H8<>\"\",$H8,TIME(0,0,0)),IF($AL8,IF(AND($H8<>\"\",$H8>$AF8),$H8,$AF8),\"\"))","v":""},{"$f":"IF($AL8,IF($M8<>\"\",$M8,$BC8),\"\")","v":""},{"$f":"IF($B8=\"Sa\",IF($L8=\"\",TIME(0,0,0),$L8),IF($AL8,IF($L8<>\"\",$L8,IF(AND($H8<>\"\",$H8>$AF8),$H8,$AF8)),\"\"))","v":""},{"$f":"IF($AL8,TIME(23,59,0),\"\")","v":""},{"$f":"MOD($L8*24,0.25)=0","v":true},{"$f":"AND($AL8,ISNUMBER($L8),$L8>=$AZ8,$BA8>=$L8)","v":false},{"$f":"MOD($M8*24,0.25)=0","v":true},{"$f":"AND($AL8,ISNUMBER($M8),$M8>=$BB8,$M8<=$BC8)","v":false},{"$f":"IF(AND(ISBLANK($D8),ISBLANK($G8),ISBLANK($H8),ISBLANK($L8),ISBLANK($M8),ISBLANK($P8)),0,1)","v":0}]
[{"$f":"IF($R9,$Q9,\"\")","v":"2023-02-02"},"Do"," ",null,{"$f":"IF(AND($R9,$T9<>\"F\"),IF($AC9=$AF9,\"keine NAZ\",TEXT($AC9,\"hh:mm\")&\"-\"&TEXT($AF9,\"hh:mm\")),\"\")","v":"08:00-16:00"},"08:00:00",null,null,"",0,{"$f":"IF(AND($U9=\"F\",$AM9),ROUND($V9*24,2),\"\")","v":""},null,null,"",null,null,{"$f":" Q8+1","v":"2023-02-02"},true,"","A","A",0,-0.33333333333333298,0,false,false,true,"07:00:00","08:00:00","09:00:00","14:00:00","16:00:00","18:00:00",false,{"$f":"AND($T9<>\"F\",NOT($AH9),NOT($AC9=$AF9))","v":true},false,true,{"$f":"AND(Zeitmodus=C_Gleitzeit,$U9<>\"F\",OR($B9=\"Sa\",AND($AM9,$I9>=0,NOT($AY9))))","v":false},false,{"$f":"OR($K9<>\"\",AND($L9<>\"\",$M9<>\"\"))","v":false},"00:00:00","23:59:00",{"$f":"IF($AK9,IF($G9=\"\",TagUG,$G9),\"\")","v":"00:00:00"},"23:59:00",true,false,true,false,false,false,{"$f":"AND($U9<>\"F\",OR($AW9,$AX9))","v":false},"","","","",true,false,true,false,0]
["2023-02-03","Fr"," ",null,"08:00-16:00","08:00:00",null,null,"",0,"",null,null,"",null,null,"2023-02-03",true,"","A","A",0,-0.33333333333333298,0,false,false,true,"07:00:00","08:00:00","09:00:00","12:00:00","16:00:00","18:00:00",false,true,false,true,false,false,false,"00:00:00","23:59:00","00:00:00","23:59:00",true,false,true,false,false,false,false,"","","","",true,false,true,false,0]
["2023-02-04","Sa"," Wochenende",null,"","00:00:00",null,null,"",0,"",null,null,"",null,null,"2023-02-04",true,"","F","A",0,0,0,true,false,false,"","","","","","",false,false,false,true,true,false,false,"00:00:00","23:59:00","00:00:00","23:59:00",true,false,true,false,false,false,false,"00:00:00","23:59:00","00:00:00","23:59:00",true,false,true,false,0]
["2023-02-05","So"," Wochenende",null,"","00:00:00",null,null,"",0,"",null,null,"",null,null,"2023-02-05",true,"","F","F",0,0,0,true,false,false,"","","","","","",false,false,false,true,false,false,false,"00:00:00","23:59:00","00:00:00","23:59:00",true,false,true,false,false,false,false,"","","","",true,false,true,false,0]
["2023-02-06","Mo"," ",null,"08:00-16:00","08:00:00",null,null,"",0,"",null,null,"",null,null,"2023-02-06",true,"","A","A",0,-0.33333333333333298,0,false,false,true,"07:00:00","08:00:00","09:00:00","14:00:00","16:00:00","18:00:00",false,true,false,true,false,false,false,"00:00:00","23:59:00","00:00:00","23:59:00",true,false,true,false,false,false,false,"","","","",true,false,true,false,0]
["2023-02-07","Di"," ",null,"08:00-16:00","08:00:00",null,null,"",0,"",null,null,"",null,null,"2023-02-07",true,"","A","A",0,-0.33333333333333298,0,false,false,true,"07:00:00","08:00:00","09:00:00","14:00:00","16:00:00","18:00:00",false,true,false,true,false,false,false,"00:00:00","23:59:00","00:00:00","23:59:00",true,false,true,false,false,false,false,"","","","",true,false,true,false,0]
["2023-02-08","Mi"," ",null,"08:00-16:00","08:00:00",null,null,"",0,"",null,null,"",null,null,"2023-02-08",true,"","A","A",0,-0.33333333333333298,0,false,false,true,"07:00:00","08:00:00","09:00:00","14:00:00","16:00:00","18:00:00",false,true,false,true,false,false,false,"00:00:00","23:59:00","00:00:00","23:59:00",true,false,true,false,false,false,false,"","","","",true,false,true,false,0]
["2023-02-09","Do"," ",null,"08:00-16:00","08:00:00",null,null,"",0,"",null,null,"",null,null,"2023-02-09",true,"","A","A",0,-0.33333333333333298,0,false,false,true,"07:00:00","08:00:00","09:00:00","14:00:00","16:00:00","18:00:00",false,true,false,true,false,false,false,"00:00:00","23:59:00","00:00:00","23:59:00",true,false,true,false,false,false,false,"","","","",true,false,true,false,0]
["2023-02-10","Fr"," ",null,"08:00-16:00","08:00:00",null,null,"",0,"",null,null,"",null,null,"2023-02-10",true,"","A","A",0,-0.33333333333333298,0,false,false,true,"07:00:00","08:00:00","09:00:00","12:00:00","16:00:00","18:00:00",false,true,false,true,false,false,false,"00:00:00","23:59:00","00:00:00","23:59:00",true,false,true,false,false,false,false,"","","","",true,false,true,false,0]
["2023-02-11","Sa"," Wochenende",null,"","00:00:00",null,null,"",0,"",null,null,"",null,null,"2023-02-11",true,"","F","A",0,0,0,true,false,false,"","","","","","",false,false,false,true,true,false,false,"00:00:00","23:59:00","00:00:00","23:59:00",true,false,true,false,false,false,false,"00:00:00","23:59:00","00:00:00","23:59:00",true,false,true,false,0]
["2023-02-12","So"," Wochenende",null,"","00:00:00",null,null,"",0,"",null,null,"",null,null,"2023-02-12",true,"","F","F",0,0,0,true,false,false,"","","","","","",false,false,false,true,false,false,false,"00:00:00","23:59:00","00:00:00","23:59:00",true,false,true,false,false,false,false,"","","","",true,false,true,false,0]
["2023-02-13","Mo"," ",null,"08:00-16:00","08:00:00",null,null,"",0,"",null,null,"",null,null,"2023-02-13",true,"","A","A",0,-0.33333333333333298,0,false,false,true,"07:00:00","08:00:00","09:00:00","14:00:00","16:00:00","18:00:00",false,true,false,true,false,false,false,"00:00:00","23:59:00","00:00:00","23:59:00",true,false,true,false,false,false,false,"","","","",true,false,true,false,0]
["2023-02-14","Di"," Valentinstag",null,"08:00-16:00","08:00:00",null,null,"",0,"",null,null,"",null,null,"2023-02-14",true,"","A","A",0,-0.33333333333333298,0,false,false,true,"07:00:00","08:00:00","09:00:00","14:00:00","16:00:00","18:00:00",false,true,false,true,false,false,false,"00:00:00","23:59:00","00:00:00","23:59:00",true,false,true,false,false,false,false,"","","","",true,false,true,false,0]
["2023-02-15","Mi"," ",null,"08:00-16:00","08:00:00",null,null,"",0,"",null,null,"",null,null,"2023-02-15",true,"","A","A",0,-0.33333333333333298,0,false,false,true,"07:00:00","08:00:00","09:00:00","14:00:00","16:00:00","18:00:00",false,true,false,true,false,false,false,"00:00:00","23:59:00","00:00:00","23:59:00",true,false,true,false,false,false,false,"","","","",true,false,true,false,0]
["2023-02-16","Do"," ",null,"08:00-16:00","08:00:00",null,null,"",0,"",null,null,"",null,null,"2023-02-16",true,"","A","A",0,-0.33333333333333298,0,false,false,true,"07:00:00","08:00:00","09:00:00","14:00:00","16:00:00","18:00:00",false,true,false,true,false,false,false,"00:00:00","23:59:00","00:00:00","23:59:00",true,false,true,false,false,false,false,"","","","",true,false,true,false,0]
["2023-02-17","Fr"," ",null,"08:00-16:00","08:00:00",null,null,"",0,"",null,null,"",null,null,"2023-02-17",true,"","A","A",0,-0.33333333333333298,0,false,false,true,{"$f":"IF(ISNA(VLOOKUP($B24,GAZ,AB$7,FALSE)),\"\",VLOOKUP($B24,GAZ,AB$7,FALSE))","v":"07:00:00"},"08:00:00","09:00:00","12:00:00","16:00:00","18:00:00",false,true,false,true,false,false,false,"00:00:00","23:59:00","00:00:00","23:59:00",true,false,true,false,false,false,false,"","","","",true,false,true,false,0]
["2023-02-18","Sa"," Wochenende",null,"","00:00:00",null,null,"",0,"",null,null,"",null,null,"2023-02-18",true,"","F","A",0,0,0,true,false,false,"","","","","","",false,false,false,true,true,false,false,"00:00:00","23:59:00","00:00:00","23:59:00",true,false,true,false,false,false,false,"00:00:00","23:59:00","00:00:00","23:59:00",true,false,true,false,0]
["2023-02-19","So"," Wochenende",null,"","00:00:00",null,null,"",0,"",null,null,"",null,null,"2023-02-19",true,"","F","F",0,0,0,true,false,false,"","","","","","",false,false,false,true,false,false,false,"00:00:00","23:59:00","00:00:00","23:59:00",true,false,true,false,false,false,false,"","","","",true,false,true,false,0]
["2023-02-20","Mo"," ",null,"08:00-16:00","08:00:00",null,null,"",0,"",null,null,"",null,null,"2023-02-20",true,"","A","A",0,-0.33333333333333298,0,false,false,true,"07:00:00","08:00:00","09:00:00","14:00:00","16:00:00","18:00:00",false,true,false,true,false,false,false,"00:00:00","23:59:00","00:00:00","23:59:00",true,false,true,false,false,false,false,"","","","",true,false,true,false,0]
["2023-02-21","Di"," ",null,"08:00-16:00","08:00:00",null,null,"",0,"",null,null,"",null,null,"2023-02-21",true,"","A","A",0,-0.33333333333333298,0,false,false,true,"07:00:00","08:00:00","09:00:00","14:00:00","16:00:00","18:00:00",false,true,false,true,false,false,false,"00:00:00","23:59:00","00:00:00","23:59:00",true,false,true,false,false,false,false,"","","","",true,false,true,false,0]
["2023-02-22","Mi"," Aschermittwoch",null,"08:00-16:00","08:00:00",null,null,"",0,"",null,null,"",null,null,"2023-02-22",true,"","A","A",0,-0.33333333333333298,0,false,false,true,"07:00:00","08:00:00","09:00:00","14:00:00","16:00:00","18:00:00",false,true,false,true,false,false,false,"00:00:00","23:59:00","00:00:00","23:59:00",true,false,true,false,false,false,false,"","","","",true,false,true,false,0]
["2023-02-23","Do"," ",null,"08:00-16:00","08:00:00",null,null,"",0,"",null,null,"",null,null,"2023-02-23",true,"","A","A",0,-0.33333333333333298,0,false,false,true,"07:00:00","08:00:00","09:00:00","14:00:00","16:00:00","18:00:00",false,true,false,true,false,false,false,"00:00:00","23:59:00","00:00:00","23:59:00",true,false,true,false,false,false,false,"","","","",true,false,true,false,0]
["2023-02-24","Fr"," ",null,"08:00-16:00","08:00:00",null,null,"",0,"",null,null,"",null,null,"2023-02-24",true,"","A","A",0,-0.33333333333333298,0,false,false,true,"07:00:00","08:00:00","09:00:00","12:00:00","16:00:00","18:00:00",false,true,false,true,false,false,false,"00:00:00","23:59:00","00:00:00","23:59:00",true,false,true,false,false,false,false,"","","","",true,false,true,false,0]
["2023-02-25","Sa"," Wochenende",null,"","00:00:00",null,null,"",0,"",null,null,"",null,null,"2023-02-25",true,"","F","A",0,0,0,true,false,false,"","","","","","",false,false,false,true,true,false,false,"00:00:00","23:59:00","00:00:00","23:59:00",true,false,true,false,false,false,false,"00:00:00","23:59:00","00:00:00","23:59:00",true,false,true,false,0]
["2023-02-26","So"," Wochenende",null,"","00:00:00",null,null,"",0,"",null,null,"",null,null,"2023-02-26",true,"","F","F",0,0,0,true,false,false,"","","","","","",false,false,false,true,false,false,false,"00:00:00","23:59:00","00:00:00","23:59:00",true,false,true,false,false,false,false,"","","","",true,false,true,false,0]
["2023-02-27","Mo"," ",null,"08:00-16:00","08:00:00",null,null,"",0,"",null,null,"",null,null,"2023-02-27",true,"","A","A",0,-0.33333333333333298,0,false,false,true,"07:00:00","08:00:00","09:00:00","14:00:00","16:00:00","18:00:00",false,true,false,true,false,false,false,"00:00:00","23:59:00","00:00:00","23:59:00",true,false,true,false,false,false,false,"","","","",true,false,true,false,0]
["2023-02-28","Di"," ",null,"08:00-16:00","08:00:00",null,null,"",0,"",null,null,"",null,null,"2023-02-28",true,"","A","A",0,-0.33333333333333298,0,false,false,true,"07:00:00","08:00:00","09:00:00","14:00:00","16:00:00","18:00:00",false,true,false,true,false,false,false,"00:00:00","23:59:00","00:00:00","23:59:00",true,false,true,false,false,false,false,"","","","",true,false,true,false,0]
["","","",null,"","",null,null,"","","",null,null,"",null,null,"2023-03-01",false,"","","",0,"",0,false,true,false,"","","","","","",false,false,false,false,false,false,false,"","","","",true,false,true,false,false,false,false,"","","","",true,false,true,false,0]
["","","",null,"","",null,null,"","","",null,null,"",null,null,"2023-03-02",false,"","","",0,"",0,false,true,false,"","","","","","",false,false,false,false,false,false,false,"","","","",true,false,true,false,false,false,false,"","","","",true,false,true,false,0]
["","","",null,"","",null,null,"",{"$f":"IF($R38,$X38,\"\")","v":""},"",null,null,"",null,null,"2023-03-03",false,"","","",0,"",0,false,true,false,"","","","","","",false,false,false,false,false,false,false,"","","","",true,false,true,false,false,false,false,"","","","",true,false,true,false,0]
["Arbeitstage",{"$f":"COUNTIF(T$8:T$38,\"A\")","v":20},null,null,{"$f":"\"Saldo Monat (~15min) > \"","v":"Saldo Monat (~15min) > "},null,null,null,{"$f":"ROUND(SUM(I8:I38)*4,0)/4","v":0},null,{"$f":"SUM(K8:K38)","v":0}," < ÜS1:2",null,{"$f":"SUM(N8:N38)","v":0},{"$f":"IF(Zeitmodell=\"Vollzeit\",\" < ÜS1:1,5 \",\" < ÜS1:1,25 \")&Zeitmodell","v":" < ÜS1:1,5 Vollzeit"},null,"Zeitmodell Text"]
["Freie Tage",{"$f":"COUNTIF(T$8:T$38,\"F\")","v":8},null,null,{"$f":"\"Saldo \"&IF(Zeitmodell=\"Vollzeit\",\"1:1,5\",\"1:1,25\")& \" (~15min) > \"","v":"Saldo 1:1,5 (~15min) > "},null,null,null,{"$f":"ROUND($N40*4,0)/4","v":0},null,null,null,null,{"$f":"IF(Zeitmodell=\"Vollzeit\",$N39*1.5,$N39*1.25)","v":0},{"$f":"IF(Zeitmodell=\"Vollzeit\",\" < 1:1,5 \",\" < 1:1,25 \")&$Q40","v":" < 1:1,5 Stunden berechnen"},null,"Stunden berechnen"]
["ZK-Tage",0,null,null,"Saldo 1:2 (~15min) > ",null,null,null,{"$f":"ROUND($N41*4,0)/4","v":0},null,null,null,null,{"$f":"K39*2","v":0}," < 1:2    Stunden berechnen"]
["ZA-Tage",{"$f":"COUNTIF(D$8:D$38,\"Z\")","v":0},null,null," Saldo Vormonat > ",null,null,null,{"$f":"$J5","v":0},null,null,null,null,null,null,null,"Gültigkeit ausbezahlt"]
["Urlaubstage",{"$f":"COUNTIF(D$8:D$38,\"U\")","v":0},null,null," Saldo Gesamt > ",null,null,null,{"$f":"SUM(I39:I42)","v":0},null,{"$f":"IF($I$43>=$R$2,\"< Hier ausbezahlte Std. eingeben. (Die Eingabe ist hier erst ab   < einem Saldo von \"&TEXT($R$2,\"#.##0,00\")&\" Std., und nur in 0,25-Schritten möglich.)\",\"\")","v":""},null,null,null,null,null,{"$f":"IF(AND($J$43<>\"\",NOT(ISNUMBER($J$43))),FALSE,OR(AND($J$43>=0,$J$43<=$I$43,MOD($J$43,0.25)=0),$J$43=\"\"))","v":true}]
["Krank",{"$f":"COUNTIF(D$8:D$38,\"K\")","v":0},null,null," Saldo Übertrag > ",null,null,null,{"$f":"$I43-$J43","v":0},{"$f":"\" < Dieser Stunden-Saldo wird in das nächste \"&IF($Q$3=\"Dezember\",\"Jahr\",\"Monat\")&\" übertragen\"","v":" < Dieser Stunden-Saldo wird in das nächste Monat übertragen"}]
[null,null,null,"Z"]
[]
[]
[{"$f":"\"Unterschrift von \"&Vorgesetzter","v":"Unterschrift von Vorname Nachname"},null,null,null,null,null,null,null,null,null,null,{"$f":"\"Unterschrift von \"&Name","v":"Unterschrift von Vorname Nachname"}]

{"sheet":"März","index":3,"n_rows":48,"n_cols":60,"rows_kept":48,"cut":false,"hidden":true,"merged":[[47,0,47,3],[47,11,47,15],[42,4,42,7],[42,10,42,15],[43,4,43,7],[44,4,44,7],[45,4,45,7],[46,4,46,7],[38,2,43,3],[38,4,38,7],[38,11,38,12],[38,14,38,15],[39,4,39,7],[39,14,39,15],[40,4,40,7],[40,14,40,15],[41,4,41,7],[41,10,41,15],[5,7,6,7],[5,10,6,10],[5,11,6,11],[5,12,6,12],[5,13,6,13],[5,27,5,32],[4,2,4,3],[4,4,4,5],[5,2,6,2],[5,3,6,3],[5,5,6,5],[5,6,6,6],[0,15,1,15],[1,5,1,7],[2,5,2,7],[3,0,3,3],[3,4,3,5],[3,6,4,8],[3,14,6,14],[3,15,6,15],[4,0,6,0],[4,1,6,1]]}
[" BOKU-Zeiterfassung für Allgemeines Personal",null,null,null,null,null,null,null,null,null,null,null,null,null,null,null,"Monat","Stunden-Saldo Grenzen","Status Blatteingabe"]
[{"$f":"\" Org.-Einh. : \"&OrgEinheit","v":" Org.-Einh. : HXXXXX"},null,null,null,null,"Zeitmodell:",null,null,{"$f":"\" \"&Zeitmodell","v":" Vollzeit"},"Modus:",{"$f":"\" \"&Zeitmodus","v":" Gleitzeit"},null,null,null,null,null,{"$f":"IF(ISNA($Q$4),1,$Q$4)","v":3},{"$f":"IF($Q$2=12,NormalOGDez,NormalOG)","v":71.999999999999986},{"$f":"SUM($BH8:$BH38)","v":0}]
[{"$f":" \" Mitarbeiter/in: \"&Name","v":" Mitarbeiter/in: Vorname Nachname"},null,null,null,null,"Vorgesetzte/r:",null,null,{"$f":"\" \"&Vorgesetzter","v":" Vorname Nachname"},null,null,null,null,null,null,null,{"$f":"RIGHT(CELL(\"filename\",A1),LEN(CELL(\"filename\",A1))-SEARCH(\"]\",CELL(\"filename\",A1),1))","v":"März"},{"$f":"IF($Q$2=12,NormalUGDez,NormalUG)","v":-24},{"$f":"IF($Q$2=1,$S$2,$S$2+INDIRECT($S$5))","v":0}]
[{"$f":" \" Monat: \"&$Q$3&\" \"&Jahr","v":" Monat: März 2023"},null,null,null,"Dienstplan",null,"Normalstunden Feiertag-ÜS1:2",null,null,"Übertrag","Überstundenberechnung",null,null,null," Unterschrift des\n Vorgesetzten","Anmerkungen \n(z.B. Überstunden- notwendigkeit)",{"$f":"IF(ISNA(VLOOKUP($Q$3,MTab,2,FALSE)),1,VLOOKUP($Q$3,MTab,2,FALSE))","v":3},null,"Übertrags Adresse Blatteingabe"]
[" Datum","Wochentag","Tagesinformationen",null,{"$f":"\"Wochen-AZ\"&\" \"&TEXT(WAZ,\"[hh]:mm\")","v":"Wochen-AZ 40:00"},null,null,null,null,{"$f":"IF(ISNA($Q$5),Übertrag,INDIRECT($Q$5))","v":0},"ÜS1:2",{"$f":"IF(Zeitmodell=\"Vollzeit\",\" Überstunden1:1,5\",\" Überstunden1:1,25\")","v":" Überstunden1:1,5"},null,null,null,null,{"$f":"IF(ISNA(VLOOKUP($Q$3,MTab,3,FALSE)),\"Übertrag\",VLOOKUP($Q$3,MTab,3,FALSE))","v":"Februar!$I$44"},null,{"$f":"IF(ISNA(VLOOKUP($Q$3,MTab,4,FALSE)),$Q$3&\"!$S$2\",VLOOKUP($Q$3,MTab,4,FALSE))","v":"Februar!$S$3"}]
[null,null," Feiertage\n Wochenende\n Urlaub, ZA, Krank","[U]rlaub\n[Z]A\n[ZK]\n[K]rank","Normal-","Soll","Von","Bis","Plus","Saldo","Plus","Von","Bis","Plus",null,null,"Hintergrundberechnungen",null,null,null,null,null,null,"Saldo aktuell",null,null,null,"GAZ-Tabellenabbildung",null,null,null,null,null,"Eingabebeprüfungen"]
[null,null,null,null,"Arbeitszeit",null,null,null,"Minus","akuell",null,null,null,null,null,null,"Datum","Monat OK","Abwesenh.","Freie Tage","ÜA-Tage","Std.","Soll-Std.",{"$f":"IF(ISNA($Q$5),Übertrag,INDIRECT($Q$5))","v":0},"Std.-Soll = 0","Std.-Soll > 0","Std.-Soll < 0",{"$f":"I_GAZGRVon","v":2},{"$f":"I_GAZNAZVon","v":3},{"$f":"I_GAZKVon","v":4},{"$f":"I_GAZKBis","v":6},{"$f":"I_GAZNAZBis","v":7},{"$f":"I_GAZGRBis","v":8},"Zeiteingabe","UZK-Eing.\nerlaubt","UZK-Eing.\ngültig","Normalst. ein erlaubt","Überstd. ein erlaubt","Normalstd.\neingegeben","Überstd.\neingegeben","Normal VON möglich OG","Normal VON möglich UG","Normal BIS möglich OG","Normal BIS möglich UG","Normal VON\n15min","Normal VON richtig","Normal BIS\n15min","Normal BIS richtig","ZA-Kern Von","ZA-Kern Bis","ZA-Kern","Über VON Obergrenze","Über VON Untergrenze","Über BIS Obergrenze","Über BIS Untergrenze","Über VON\n15min","Über VON richtig","Überl BIS\n15min","Über BIS richtig","Status Zeilen Eingabe"]
[{"$f":"IF($R8,$Q8,\"\")","v":"2023-03-01"},{"$f":"IF($R8,VLOOKUP(WEEKDAY($Q8,2),WOTA,2,FALSE),\"\")","v":"Mi"},{"$f":"IF($R8,\" \"&IF($S8=\"\",VLOOKUP($Q8,FListe,3,FALSE),$S8),\"\")","v":" "},null,{"$f":"IF(AND($R8,$T8<>\"F\"),IF($AC8=$AF8,\"keine NAZ\",TEXT($AC8,\"hh:mm\")&\"-\"&TEXT($AF8,\"hh:mm\")),\"\")","v":"08:00-16:00"},{"$f":"IF($R8,IF($T8=\"F\",0,VLOOKUP($B8,GAZ,I_GAZNAZ,FALSE)),\"\")","v":"08:00:00"},null,null,{"$f":"IF(Zeitmodus=\"Gleitzeit\",IF($U8=\"F\",\"\",IF(AND($R8,$AM8,NOT($Y8)),ROUND(($V8-$F8)*24,2),IF($D8=\"Z\",$F8*-24,\"\"))),IF(OR($D8=\"Z\",AND($AM8,$U8=\"A\",W8<0)),ROUND($W8*24,2),\"\"))","v":""},{"$f":"IF($R8,$X8,\"\")","v":0},{"$f":"IF(AND($U8=\"F\",$AM8),ROUND($V8*24,2),\"\")","v":""},null,null,{"$f":"IF(Zeitmodus=\"Gleitzeit\",IF(AND($R8,$AN8,$M8-$L8<>0,$AL8),ROUND(($M8-$L8)*24,2),\"\"),IF(AND($AM8,$U8=\"A\",W8>0),ROUND(W8*24,2),\"\"))","v":""},null,null,{"$f":"DATE(Jahr,$Q2,1)","v":"2023-03-01"},{"$f":"$Q$2=MONTH($Q8)","v":true},{"$f":"IF(OR($D8=\"U\",$D8=\"Z\",$D8=\"ZK\",$D8=\"K\"),VLOOKUP($D8,UZK,2,FALSE),\"\")","v":""},{"$f":"IF($R8,VLOOKUP($Q8,FListe,4,FALSE),\"\")","v":"A"},{"$f":"IF($R8,VLOOKUP($Q8,FListe,5,FALSE),\"\")","v":"A"},{"$f":"$H8-$G8","v":0},{"$f":"IF($R8,ROUND($V8-$F8,15),\"\")","v":-0.33333333333333298},{"$f":"IF($I8<>\"\",$X7+$I8,$X7)","v":0},{"$f":"($W8=0)","v":false},{"$f":"($W8>0)","v":false},{"$f":"($W8<0)","v":true},{"$f":"IF(ISNA(VLOOKUP($B8,GAZ,AB$7,FALSE)),\"\",VLOOKUP($B8,GAZ,AB$7,FALSE))","v":"07:00:00"},"08:00:00",{"$f":"IF(ISNA(VLOOKUP($B8,GAZ,AD$7,FALSE)),\"\",IF($AC8=$AF8,$G8,VLOOKUP($B8,GAZ,AD$7,FALSE)))","v":"09:00:00"},{"$f":"IF(ISNA(VLOOKUP($B8,GAZ,AE$7,FALSE)),\"\",IF($AC8=$AF8,$H8,VLOOKUP($B8,GAZ,AE$7,FALSE)))","v":"14:00:00"},"16:00:00","18:00:00",{"$f":"OR($G8<>\"\",$H8<>\"\",$L8<>\"\",$M8<>\"\")","v":false},{"$f":"AND($T8<>\"F\",NOT($AH8),NOT($AC8=$AF8))","v":true},{"$f":"AND($AI8,OR($D8=\"U\",$D8=\"Z\",$D8=\"K\"))","v":false},{"$f":"AND($D8<>\"U\",$D8<>\"Z\",$D8<>\"K\",$R8)","v":true},{"$f":"AND(Zeitmodus=C_Gleitzeit,$U8<>\"F\",OR($B8=\"Sa\",AND($AM8,$I8>=0,NOT($AY8))))","v":false},{"$f":"AND($G8<>\"\",$H8<>\"\")","v":false},{"$f":"OR($K8<>\"\",AND($L8<>\"\",$M8<>\"\"))","v":false},{"$f":"IF($AK8,TagUG,\"\")","v":"00:00:00"},{"$f":"IF($AK8,IF($H8=\"\",IF(AND($L8<>\"\",$L8<$AG8),$L8,IF(AND($M8<>\"\",$M8<$AG8),$M8,TagOG)),$H8),\"\")","v":"23:59:00"},{"$f":"IF($AK8,IF($G8=\"\",$AB8,$G8),\"\")","v":"07:00:00"},{"$f":"IF($AK8,IF(AND($L8<>\"\",$L8<$AG8),$L8,IF(AND($M8<>\"\",$M8<$AG8),$M8,TagOG)),\"\")","v":"23:59:00"},{"$f":"MOD($G8*24,0.25)=0","v":true},{"$f":"AND($AK8,ISNUMBER($G8),$G8>=$AO8,$G8<=$AP8)","v":false},{"$f":"MOD($H8*24,0.25)=0","v":true},{"$f":"AND($AK8,ISNUMBER($H8),$H8>=$AQ8,$H8<=$AR8)","v":false},{"$f":"AND(Zeitmodus=C_Gleitzeit,$B8<>\"Sa\",$G8<>\"\",$G8>$AD8)","v":false},{"$f":"AND(Zeitmodus=C_Gleitzeit,$B8<>\"Sa\",$H8<>\"\",$H8<$AE8)","v":false},{"$f":"AND($U8<>\"F\",OR($AW8,$AX8))","v":false},{"$f":"IF($B8=\"Sa\",IF($H8<>\"\",$H8,TIME(0,0,0)),IF($AL8,IF(AND($H8<>\"\",$H8>$AF8),$H8,$AF8),\"\"))","v":""},{"$f":"IF($AL8,IF($M8<>\"\",$M8,$BC8),\"\")","v":""},{"$f":"IF($B8=\"Sa\",IF($L8=\"\",TIME(0,0,0),$L8),IF($AL8,IF($L8<>\"\",$L8,IF(AND($H8<>\"\",$H8>$AF8),$H8,$AF8)),\"\"))","v":""},{"$f":"IF($AL8,TIME(23,59,0),\"\")","v":""},{"$f":"MOD($L8*24,0.25)=0","v":true},{"$f":"AND($AL8,ISNUMBER($L8),$L8>=$AZ8,$BA8>=$L8)","v":false},{"$f":"MOD($M8*24,0.25)=0","v":true},{"$f":"AND($AL8,ISNUMBER($M8),$M8>=$BB8,$M8<=$BC8)","v":false},{"$f":"IF(AND(ISBLANK($D8),ISBLANK($G8),ISBLANK($H8),ISBLANK($L8),ISBLANK($M8),ISBLANK($P8)),0,1)","v":0}]
[{"$f":"IF($R9,$Q9,\"\")","v":"2023-03-02"},"Do"," ",null,{"$f":"IF(AND($R9,$T9<>\"F\"),IF($AC9=$AF9,\"keine NAZ\",TEXT($AC9,\"hh:mm\")&\"-\"&TEXT($AF9,\"hh:mm\")),\"\")","v":"08:00-16:00"},"08:00:00",null,null,"",0,{"$f":"IF(AND($U9=\"F\",$AM9),ROUND($V9*24,2),\"\")","v":""},null,null,"",null,null,{"$f":" Q8+1","v":"2023-03-02"},true,"","A","A",0,-0.33333333333333298,0,false,false,true,"07:00:00","08:00:00","09:00:00","14:00:00","16:00:00","18:00:00",false,{"$f":"AND($T9<>\"F\",NOT($AH9),NOT($AC9=$AF9))","v":true},false,true,{"$f":"AND(Zeitmodus=C_Gleitzeit,$U9<>\"F\",OR($B9=\"Sa\",AND($AM9,$I9>=0,NOT($AY9))))","v":false},false,{"$f":"OR($K9<>\"\",AND($L9<>\"\",$M9<>\"\"))","v":false},"00:00:00","23:59:00",{"$f":"IF($AK9,IF($G9=\"\",TagUG,$G9),\"\")","v":"00:00:00"},"23:59:00",true,false,true,false,false,false,{"$f":"AND($U9<>\"F\",OR($AW9,$AX9))","v":false},"","","","",true,false,true,false,0]
["2023-03-03","Fr"," ",null,"08:00-16:00","08:00:00",null,null,"",0,"",null,null,"",null,null,"2023-03-03",true,"","A","A",0,-0.33333333333333298,0,false,false,true,"07:00:00","08:00:00","09:00:00","12:00:00","16:00:00","18:00:00",false,true,false,true,false,false,false,"00:00:00","23:59:00","00:00:00","23:59:00",true,false,true,false,false,false,false,"","","","",true,false,true,false,0]
["2023-03-04","Sa"," Wochenende",null,"","00:00:00",null,null,"",0,"",null,null,"",null,null,"2023-03-04",true,"","F","A",0,0,0,true,false,false,"","","","","","",false,false,false,true,true,false,false,"00:00:00","23:59:00","00:00:00","23:59:00",true,false,true,false,false,false,false,"00:00:00","23:59:00","00:00:00","23:59:00",true,false,true,false,0]
["2023-03-05","So"," Wochenende",null,"","00:00:00",null,null,"",0,"",null,null,"",null,null,"2023-03-05",true,"","F","F",0,0,0,true,false,false,"","","","","","",false,false,false,true,false,false,false,"00:00:00","23:59:00","00:00:00","23:59:00",true,false,true,false,false,false,false,"","","","",true,false,true,false,0]
["2023-03-06","Mo"," ",null,"08:00-16:00","08:00:00",null,null,"",0,"",null,null,"",null,null,"2023-03-06",true,"","A","A",0,-0.33333333333333298,0,false,false,true,"07:00:00","08:00:00","09:00:00","14:00:00","16:00:00","18:00:00",false,true,false,true,false,false,false,"00:00:00","23:59:00","00:00:00","23:59:00",true,false,true,false,false,false,false,"","","","",true,false,true,false,0]
["2023-03-07","Di"," ",null,"08:00-16:00","08:00:00",null,null,"",0,"",null,null,"",null,null,"2023-03-07",true,"","A","A",0,-0.33333333333333298,0,false,false,true,"07:00:00","08:00:00","09:00:00","14:00:00","16:00:00","18:00:00",false,true,false,true,false,false,false,"00:00:00","23:59:00","00:00:00","23:59:00",true,false,true,false,false,false,false,"","","","",true,false,true,false,0]
["2023-03-08","Mi"," ",null,"08:00-16:00","08:00:00",null,null,"",0,"",null,null,"",null,null,"2023-03-08",true,"","A","A",0,-0.33333333333333298,0,false,false,true,"07:00:00","08:00:00","09:00:00","14:00:00","16:00:00","18:00:00",false,true,false,true,false,false,false,"00:00:00","23:59:00","00:00:00","23:59:00",true,false,true,false,false,false,false,"","","","",true,false,true,false,0]
["2023-03-09","Do"," ",null,"08:00-16:00","08:00:00",null,null,"",0,"",null,null,"",null,null,"2023-03-09",true,"","A","A",0,-0.33333333333333298,0,false,false,true,"07:00:00","08:00:00","09:00:00","14:00:00","16:00:00","18:00:00",false,true,false,true,false,false,false,"00:00:00","23:59:00","00:00:00","23:59:00",true,false,true,false,false,false,false,"","","","",true,false,true,false,0]
["2023-03-10","Fr"," ",null,"08:00-16:00","08:00:00",null,null,"",0,"",null,null,"",null,null,"2023-03-10",true,"","A","A",0,-0.33333333333333298,0,false,false,true,"07:00:00","08:00:00","09:00:00","12:00:00","16:00:00","18:00:00",false,true,false,true,false,false,false,"00:00:00","23:59:00","00:00:00","23:59:00",true,false,true,false,false,false,false,"","","","",true,false,true,false,0]
["2023-03-11","Sa"," Wochenende",null,"","00:00:00",null,null,"",0,"",null,null,"",null,null,"2023-03-11",true,"","F","A",0,0,0,true,false,false,"","","","","","",false,false,false,true,true,false,false,"00:00:00","23:59:00","00:00:00","23:59:00",true,false,true,false,false,false,false,"00:00:00","23:59:00","00:00:00","23:59:00",true,false,true,false,0]
["2023-03-12","So"," Wochenende",null,"","00:00:00",null,null,"",0,"",null,null,"",null,null,"2023-03-12",true,"","F","F",0,0,0,true,false,false,"","","","","","",false,false,false,true,false,false,false,"00:00:00","23:59:00","00:00:00","23:59:00",true,false,true,false,false,false,false,"","","","",true,false,true,false,0]
["2023-03-13","Mo"," ",null,"08:00-16:00","08:00:00",null,null,"",0,"",null,null,"",null,null,"2023-03-13",true,"","A","A",0,-0.33333333333333298,0,false,false,true,"07:00:00","08:00:00","09:00:00","14:00:00","16:00:00","18:00:00",false,true,false,true,false,false,false,"00:00:00","23:59:00","00:00:00","23:59:00",true,false,true,false,false,false,false,"","","","",true,false,true,false,0]
["2023-03-14","Di"," ",null,"08:00-16:00","08:00:00",null,null,"",0,"",null,null,"",null,null,"2023-03-14",true,"","A","A",0,-0.33333333333333298,0,false,false,true,"07:00:00","08:00:00","09:00:00","14:00:00","16:00:00","18:00:00",false,true,false,true,false,false,false,"00:00:00","23:59:00","00:00:00","23:59:00",true,false,true,false,false,false,false,"","","","",true,false,true,false,0]
["2023-03-15","Mi"," ",null,"08:00-16:00","08:00:00",null,null,"",0,"",null,null,"",null,null,"2023-03-15",true,"","A","A",0,-0.33333333333333298,0,false,false,true,"07:00:00","08:00:00","09:00:00","14:00:00","16:00:00","18:00:00",false,true,false,true,false,false,false,"00:00:00","23:59:00","00:00:00","23:59:00",true,false,true,false,false,false,false,"","","","",true,false,true,false,0]
["2023-03-16","Do"," ",null,"08:00-16:00","08:00:00",null,null,"",0,"",null,null,"",null,null,"2023-03-16",true,"","A","A",0,-0.33333333333333298,0,false,false,true,"07:00:00","08:00:00","09:00:00","14:00:00","16:00:00","18:00:00",false,true,false,true,false,false,false,"00:00:00","23:59:00","00:00:00","23:59:00",true,false,true,false,false,false,false,"","","","",true,false,true,false,0]
["2023-03-17","Fr"," ",null,"08:00-16:00","08:00:00",null,null,"",0,"",null,null,"",null,null,"2023-03-17",true,"","A","A",0,-0.33333333333333298,0,false,false,true,{"$f":"IF(ISNA(VLOOKUP($B24,GAZ,AB$7,FALSE)),\"\",VLOOKUP($B24,GAZ,AB$7,FALSE))","v":"07:00:00"},"08:00:00","09:00:00","12:00:00","16:00:00","18:00:00",false,true,false,true,false,false,false,"00:00:00","23:59:00","00:00:00","23:59:00",true,false,true,false,false,false,false,"","","","",true,false,true,false,0]
["2023-03-18","Sa"," Wochenende",null,"","00:00:00",null,null,"",0,"",null,null,"",null,null,"2023-03-18",true,"","F","A",0,0,0,true,false,false,"","","","","","",false,false,false,true,true,false,false,"00:00:00","23:59:00","00:00:00","23:59:00",true,false,true,false,false,false,false,"00:00:00","23:59:00","00:00:00","23:59:00",true,false,true,false,0]
["2023-03-19","So"," Wochenende",null,"","00:00:00",null,null,"",0,"",null,null,"",null,null,"2023-03-19",true,"","F","F",0,0,0,true,false,false,"","","","","","",false,false,false,true,false,false,false,"00:00:00","23:59:00","00:00:00","23:59:00",true,false,true,false,false,false,false,"","","","",true,false,true,false,0]
["2023-03-20","Mo"," ",null,"08:00-16:00","08:00:00",null,null,"",0,"",null,null,"",null,null,"2023-03-20",true,"","A","A",0,-0.33333333333333298,0,false,false,true,"07:00:00","08:00:00","09:00:00","14:00:00","16:00:00","18:00:00",false,true,false,true,false,false,false,"00:00:00","23:59:00","00:00:00","23:59:00",true,false,true,false,false,false,false,"","","","",true,false,true,false,0]
["2023-03-21","Di"," ",null,"08:00-16:00","08:00:00",null,null,"",0,"",null,null,"",null,null,"2023-03-21",true,"","A","A",0,-0.33333333333333298,0,false,false,true,"07:00:00","08:00:00","09:00:00","14:00:00","16:00:00","18:00:00",false,true,false,true,false,false,false,"00:00:00","23:59:00","00:00:00","23:59:00",true,false,true,false,false,false,false,"","","","",true,false,true,false,0]
["2023-03-22","Mi"," ",null,"08:00-16:00","08:00:00",null,null,"",0,"",null,null,"",null,null,"2023-03-22",true,"","A","A",0,-0.33333333333333298,0,false,false,true,"07:00:00","08:00:00","09:00:00","14:00:00","16:00:00","18:00:00",false,true,false,true,false,false,false,"00:00:00","23:59:00","00:00:00","23:59:00",true,false,true,false,false,false,false,"","","","",true,false,true,false,0]
["2023-03-23","Do"," ",null,"08:00-16:00","08:00:00",null,null,"",0,"",null,null,"",null,null,"2023-03-23",true,"","A","A",0,-0.33333333333333298,0,false,false,true,"07:00:00","08:00:00","09:00:00","14:00:00","16:00:00","18:00:00",false,true,false,true,false,false,false,"00:00:00","23:59:00","00:00:00","23:59:00",true,false,true,false,false,false,false,"","","","",true,false,true,false,0]
["2023-03-24","Fr"," ",null,"08:00-16:00","08:00:00",null,null,"",0,"",null,null,"",null,null,"2023-03-24",true,"","A","A",0,-0.33333333333333298,0,false,false,true,"07:00:00","08:00:00","09:00:00","12:00:00","16:00:00","18:00:00",false,true,false,true,false,false,false,"00:00:00","23:59:00","00:00:00","23:59:00",true,false,true,false,false,false,false,"","","","",true,false,true,false,0]
["2023-03-25","Sa"," Wochenende",null,"","00:00:00",null,null,"",0,"",null,null,"",null,null,"2023-03-25",true,"","F","A",0,0,0,true,false,false,"","","","","","",false,false,false,true,true,false,false,"00:00:00","23:59:00","00:00:00","23:59:00",true,false,true,false,false,false,false,"00:00:00","23:59:00","00:00:00","23:59:00",true,false,true,false,0]
["2023-03-26","So"," Wochenende",null,"","00:00:00",null,null,"",0,"",null,null,"",null,null,"2023-03-26",true,"","F","F",0,0,0,true,false,false,"","","","","","",false,false,false,true,false,false,false,"00:00:00","23:59:00","00:00:00","23:59:00",true,false,true,false,false,false,false,"","","","",true,false,true,false,0]
["2023-03-27","Mo"," ",null,"08:00-16:00","08:00:00",null,null,"",0,"",null,null,"",null,null,"2023-03-27",true,"","A","A",0,-0.33333333333333298,0,false,false,true,"07:00:00","08:00:00","09:00:00","14:00:00","16:00:00","18:00:00",false,true,false,true,false,false,false,"00:00:00","23:59:00","00:00:00","23:59:00",true,false,true,false,false,false,false,"","","","",true,false,true,false,0]
["2023-03-28","Di"," ",null,"08:00-16:00","08:00:00",null,null,"",0,"",null,null,"",null,null,"2023-03-28",true,"","A","A",0,-0.33333333333333298,0,false,false,true,"07:00:00","08:00:00","09:00:00","14:00:00","16:00:00","18:00:00",false,true,false,true,false,false,false,"00:00:00","23:59:00","00:00:00","23:59:00",true,false,true,false,false,false,false,"","","","",true,false,true,false,0]
["2023-03-29","Mi"," ",null,"08:00-16:00","08:00:00",null,null,"",0,"",null,null,"",null,null,"2023-03-29",true,"","A","A",0,-0.33333333333333298,0,false,false,true,"07:00:00","08:00:00","09:00:00","14:00:00","16:00:00","18:00:00",false,true,false,true,false,false,false,"00:00:00","23:59:00","00:00:00","23:59:00",true,false,true,false,false,false,false,"","","","",true,false,true,false,0]
["2023-03-30","Do"," ",null,"08:00-16:00","08:00:00",null,null,"",0,"",null,null,"",null,null,"2023-03-30",true,"","A","A",0,-0.33333333333333298,0,false,false,true,"07:00:00","08:00:00","09:00:00","14:00:00","16:00:00","18:00:00",false,true,false,true,false,false,false,"00:00:00","23:59:00","00:00:00","23:59:00",true,false,true,false,false,false,false,"","","","",true,false,true,false,0]
["2023-03-31","Fr"," ",null,"08:00-16:00","08:00:00",null,null,"",{"$f":"IF($R38,$X38,\"\")","v":0},"",null,null,"",null,null,"2023-03-31",true,"","A","A",0,-0.33333333333333298,0,false,false,true,"07:00:00","08:00:00","09:00:00","12:00:00","16:00:00","18:00:00",false,true,false,true,false,false,false,"00:00:00","23:59:00","00:00:00","23:59:00",true,false,true,false,false,false,false,"","","","",true,false,true,false,0]
["Arbeitstage",{"$f":"COUNTIF(T$8:T$38,\"A\")","v":23},null,null,{"$f":"\"Saldo Monat (~15min) > \"","v":"Saldo Monat (~15min) > "},null,null,null,{"$f":"ROUND(SUM(I8:I38)*4,0)/4","v":0},null,{"$f":"SUM(K8:K38)","v":0}," < ÜS1:2",null,{"$f":"SUM(N8:N38)","v":0},{"$f":"IF(Zeitmodell=\"Vollzeit\",\" < ÜS1:1,5 \",\" < ÜS1:1,25 \")&Zeitmodell","v":" < ÜS1:1,5 Vollzeit"},null,"Zeitmodell Text"]
["Freie Tage",{"$f":"COUNTIF(T$8:T$38,\"F\")","v":8},null,null,{"$f":"\"Saldo \"&IF(Zeitmodell=\"Vollzeit\",\"1:1,5\",\"1:1,25\")& \" (~15min) > \"","v":"Saldo 1:1,5 (~15min) > "},null,null,null,{"$f":"ROUND($N40*4,0)/4","v":0},null,null,null,null,{"$f":"IF(Zeitmodell=\"Vollzeit\",$N39*1.5,$N39*1.25)","v":0},{"$f":"IF(Zeitmodell=\"Vollzeit\",\" < 1:1,5 \",\" < 1:1,25 \")&$Q40","v":" < 1:1,5 Stunden berechnen"},null,"Stunden berechnen"]
["ZK-Tage",0,null,null,"Saldo 1:2 (~15min) > ",null,null,null,{"$f":"ROUND($N41*4,0)/4","v":0},null,null,null,null,{"$f":"K39*2","v":0}," < 1:2    Stunden berechnen"]
["ZA-Tage",{"$f":"COUNTIF(D$8:D$38,\"Z\")","v":0},null,null," Saldo Vormonat > ",null,null,null,{"$f":"$J5","v":0},null,null,null,null,null,null,null,"Gültigkeit ausbezahlt"]
["Urlaubstage",{"$f":"COUNTIF(D$8:D$38,\"U\")","v":0},null,null," Saldo Gesamt > ",null,null,null,{"$f":"SUM(I39:I42)","v":0},null,{"$f":"IF($I$43>=$R$2,\"< Hier ausbezahlte Std. eingeben. (Die Eingabe ist hier erst ab   < einem Saldo von \"&TEXT($R$2,\"#.##0,00\")&\" Std., und nur in 0,25-Schritten möglich.)\",\"\")","v":""},null,null,null,null,null,{"$f":"IF(AND($J$43<>\"\",NOT(ISNUMBER($J$43))),FALSE,OR(AND($J$43>=0,$J$43<=$I$43,MOD($J$43,0.25)=0),$J$43=\"\"))","v":true}]
["Krank",{"$f":"COUNTIF(D$8:D$38,\"K\")","v":0},null,null," Saldo Übertrag > ",null,null,null,{"$f":"$I43-$J43","v":0},{"$f":"\" < Dieser Stunden-Saldo wird in das nächste \"&IF($Q$3=\"Dezember\",\"Jahr\",\"Monat\")&\" übertragen\"","v":" < Dieser Stunden-Saldo wird in das nächste Monat übertragen"}]
[null,null,null,"Z"]
[]
[]
[{"$f":"\"Unterschrift von \"&Vorgesetzter","v":"Unterschrift von Vorname Nachname"},null,null,null,null,null,null,null,null,null,null,{"$f":"\"Unterschrift von \"&Name","v":"Unterschrift von Vorname Nachname"}]

{"sheet":"April","index":4,"n_rows":48,"n_cols":60,"rows_kept":48,"cut":false,"hidden":true,"merged":[[47,0,47,3],[47,11,47,15],[42,4,42,7],[42,10,42,15],[43,4,43,7],[44,4,44,7],[45,4,45,7],[46,4,46,7],[38,2,43,3],[38,4,38,7],[38,11,38,12],[38,14,38,15],[39,4,39,7],[39,14,39,15],[40,4,40,7],[40,14,40,15],[41,4,41,7],[41,10,41,15],[5,7,6,7],[5,10,6,10],[5,11,6,11],[5,12,6,12],[5,13,6,13],[5,27,5,32],[4,2,4,3],[4,4,4,5],[5,2,6,2],[5,3,6,3],[5,5,6,5],[5,6,6,6],[0,15,1,15],[1,5,1,7],[2,5,2,7],[3,0,3,3],[3,4,3,5],[3,6,4,8],[3,14,6,14],[3,15,6,15],[4,0,6,0],[4,1,6,1]]}
[" BOKU-Zeiterfassung für Allgemeines Personal",null,null,null,null,null,null,null,null,null,null,null,null,null,null,null,"Monat","Stunden-Saldo Grenzen","Status Blatteingabe"]
[{"$f":"\" Org.-Einh. : \"&OrgEinheit","v":" Org.-Einh. : HXXXXX"},null,null,null,null,"Zeitmodell:",null,null,{"$f":"\" \"&Zeitmodell","v":" Vollzeit"},"Modus:",{"$f":"\" \"&Zeitmodus","v":" Gleitzeit"},null,null,null,null,null,{"$f":"IF(ISNA($Q$4),1,$Q$4)","v":4},{"$f":"IF($Q$2=12,NormalOGDez,NormalOG)","v":71.999999999999986},{"$f":"SUM($BH8:$BH38)","v":0}]
[{"$f":" \" Mitarbeiter/in: \"&Name","v":" Mitarbeiter/in: Vorname Nachname"},null,null,null,null,"Vorgesetzte/r:",null,null,{"$f":"\" \"&Vorgesetzter","v":" Vorname Nachname"},null,null,null,null,null,null,null,{"$f":"RIGHT(CELL(\"filename\",A1),LEN(CELL(\"filename\",A1))-SEARCH(\"]\",CELL(\"filename\",A1),1))","v":"April"},{"$f":"IF($Q$2=12,NormalUGDez,NormalUG)","v":-24},{"$f":"IF($Q$2=1,$S$2,$S$2+INDIRECT($S$5))","v":0}]
[{"$f":" \" Monat: \"&$Q$3&\" \"&Jahr","v":" Monat: April 2023"},null,null,null,"Dienstplan",null,"Normalstunden Feiertag-ÜS1:2",null,null,"Übertrag","Überstundenberechnung",null,null,null," Unterschrift des\n Vorgesetzten","Anmerkungen \n(z.B. Überstunden- notwendigkeit)",{"$f":"IF(ISNA(VLOOKUP($Q$3,MTab,2,FALSE)),1,VLOOKUP($Q$3,MTab,2,FALSE))","v":4},null,"Übertrags Adresse Blatteingabe"]
[" Datum","Wochentag","Tagesinformationen",null,{"$f":"\"Wochen-AZ\"&\" \"&TEXT(WAZ,\"[hh]:mm\")","v":"Wochen-AZ 40:00"},null,null,null,null,{"$f":"IF(ISNA($Q$5),Übertrag,INDIRECT($Q$5))","v":0},"ÜS1:2",{"$f":"IF(Zeitmodell=\"Vollzeit\",\" Überstunden1:1,5\",\" Überstunden1:1,25\")","v":" Überstunden1:1,5"},null,null,null,null,{"$f":"IF(ISNA(VLOOKUP($Q$3,MTab,3,FALSE)),\"Übertrag\",VLOOKUP($Q$3,MTab,3,FALSE))","v":"März!$I$44"},null,{"$f":"IF(ISNA(VLOOKUP($Q$3,MTab,4,FALSE)),$Q$3&\"!$S$2\",VLOOKUP($Q$3,MTab,4,FALSE))","v":"März!$S$3"}]
[null,null," Feiertage\n Wochenende\n Urlaub, ZA, Krank","[U]rlaub\n[Z]A\n[ZK]\n[K]rank","Normal-","Soll","Von","Bis","Plus","Saldo","Plus","Von","Bis","Plus",null,null,"Hintergrundberechnungen",null,null,null,null,null,null,"Saldo aktuell",null,null,null,"GAZ-Tabellenabbildung",null,null,null,null,null,"Eingabebeprüfungen"]
[null,null,null,null,"Arbeitszeit",null,null,null,"Minus","akuell",null,null,null,null,null,null,"Datum","Monat OK","Abwesenh.","Freie Tage","ÜA-Tage","Std.","Soll-Std.",{"$f":"IF(ISNA($Q$5),Übertrag,INDIRECT($Q$5))","v":0},"Std.-Soll = 0","Std.-Soll > 0","Std.-Soll < 0",{"$f":"I_GAZGRVon","v":2},{"$f":"I_GAZNAZVon","v":3},{"$f":"I_GAZKVon","v":4},{"$f":"I_GAZKBis","v":6},{"$f":"I_GAZNAZBis","v":7},{"$f":"I_GAZGRBis","v":8},"Zeiteingabe","UZK-Eing.\nerlaubt","UZK-Eing.\ngültig","Normalst. ein erlaubt","Überstd. ein erlaubt","Normalstd.\neingegeben","Überstd.\neingegeben","Normal VON möglich OG","Normal VON möglich UG","Normal BIS möglich OG","Normal BIS möglich UG","Normal VON\n15min","Normal VON richtig","Normal BIS\n15min","Normal BIS richtig","ZA-Kern Von","ZA-Kern Bis","ZA-Kern","Über VON Obergrenze","Über VON Untergrenze","Über BIS Obergrenze","Über BIS Untergrenze","Über VON\n15min","Über VON richtig","Überl BIS\n15min","Über BIS richtig","Status Zeilen Eingabe"]
[{"$f":"IF($R8,$Q8,\"\")","v":"2023-04-01"},{"$f":"IF($R8,VLOOKUP(WEEKDAY($Q8,2),WOTA,2,FALSE),\"\")","v":"Sa"},{"$f":"IF($R8,\" \"&IF($S8=\"\",VLOOKUP($Q8,FListe,3,FALSE),$S8),\"\")","v":" Wochenende"},null,{"$f":"IF(AND($R8,$T8<>\"F\"),IF($AC8=$AF8,\"keine NAZ\",TEXT($AC8,\"hh:mm\")&\"-\"&TEXT($AF8,\"hh:mm\")),\"\")","v":""},{"$f":"IF($R8,IF($T8=\"F\",0,VLOOKUP($B8,GAZ,I_GAZNAZ,FALSE)),\"\")","v":"00:00:00"},null,null,{"$f":"IF(Zeitmodus=\"Gleitzeit\",IF($U8=\"F\",\"\",IF(AND($R8,$AM8,NOT($Y8)),ROUND(($V8-$F8)*24,2),IF($D8=\"Z\",$F8*-24,\"\"))),IF(OR($D8=\"Z\",AND($AM8,$U8=\"A\",W8<0)),ROUND($W8*24,2),\"\"))","v":""},{"$f":"IF($R8,$X8,\"\")","v":0},{"$f":"IF(AND($U8=\"F\",$AM8),ROUND($V8*24,2),\"\")","v":""},null,null,{"$f":"IF(Zeitmodus=\"Gleitzeit\",IF(AND($R8,$AN8,$M8-$L8<>0,$AL8),ROUND(($M8-$L8)*24,2),\"\"),IF(AND($AM8,$U8=\"A\",W8>0),ROUND(W8*24,2),\"\"))","v":""},null,null,{"$f":"DATE(Jahr,$Q2,1)","v":"2023-04-01"},{"$f":"$Q$2=MONTH($Q8)","v":true},{"$f":"IF(OR($D8=\"U\",$D8=\"Z\",$D8=\"ZK\",$D8=\"K\"),VLOOKUP($D8,UZK,2,FALSE),\"\")","v":""},{"$f":"IF($R8,VLOOKUP($Q8,FListe,4,FALSE),\"\")","v":"F"},{"$f":"IF($R8,VLOOKUP($Q8,FListe,5,FALSE),\"\")","v":"A"},{"$f":"$H8-$G8","v":0},{"$f":"IF($R8,ROUND($V8-$F8,15),\"\")","v":0},{"$f":"IF($I8<>\"\",$X7+$I8,$X7)","v":0},{"$f":"($W8=0)","v":true},{"$f":"($W8>0)","v":false},{"$f":"($W8<0)","v":false},{"$f":"IF(ISNA(VLOOKUP($B8,GAZ,AB$7,FALSE)),\"\",VLOOKUP($B8,GAZ,AB$7,FALSE))","v":""},"",{"$f":"IF(ISNA(VLOOKUP($B8,GAZ,AD$7,FALSE)),\"\",IF($AC8=$AF8,$G8,VLOOKUP($B8,GAZ,AD$7,FALSE)))","v":""},{"$f":"IF(ISNA(VLOOKUP($B8,GAZ,AE$7,FALSE)),\"\",IF($AC8=$AF8,$H8,VLOOKUP($B8,GAZ,AE$7,FALSE)))","v":""},"","",{"$f":"OR($G8<>\"\",$H8<>\"\",$L8<>\"\",$M8<>\"\")","v":false},{"$f":"AND($T8<>\"F\",NOT($AH8),NOT($AC8=$AF8))","v":false},{"$f":"AND($AI8,OR($D8=\"U\",$D8=\"Z\",$D8=\"K\"))","v":false},{"$f":"AND($D8<>\"U\",$D8<>\"Z\",$D8<>\"K\",$R8)","v":true},{"$f":"AND(Zeitmodus=C_Gleitzeit,$U8<>\"F\",OR($B8=\"Sa\",AND($AM8,$I8>=0,NOT($AY8))))","v":true},{"$f":"AND($G8<>\"\",$H8<>\"\")","v":false},{"$f":"OR($K8<>\"\",AND($L8<>\"\",$M8<>\"\"))","v":false},{"$f":"IF($AK8,TagUG,\"\")","v":"00:00:00"},{"$f":"IF($AK8,IF($H8=\"\",IF(AND($L8<>\"\",$L8<$AG8),$L8,IF(AND($M8<>\"\",$M8<$AG8),$M8,TagOG)),$H8),\"\")","v":"23:59:00"},{"$f":"IF($AK8,IF($G8=\"\",$AB8,$G8),\"\")","v":""},{"$f":"IF($AK8,IF(AND($L8<>\"\",$L8<$AG8),$L8,IF(AND($M8<>\"\",$M8<$AG8),$M8,TagOG)),\"\")","v":"23:59:00"},{"$f":"MOD($G8*24,0.25)=0","v":true},{"$f":"AND($AK8,ISNUMBER($G8),$G8>=$AO8,$G8<=$AP8)","v":false},{"$f":"MOD($H8*24,0.25)=0","v":true},{"$f":"AND($AK8,ISNUMBER($H8),$H8>=$AQ8,$H8<=$AR8)","v":false},{"$f":"AND(Zeitmodus=C_Gleitzeit,$B8<>\"Sa\",$G8<>\"\",$G8>$AD8)","v":false},{"$f":"AND(Zeitmodus=C_Gleitzeit,$B8<>\"Sa\",$H8<>\"\",$H8<$AE8)","v":false},{"$f":"AND($U8<>\"F\",OR($AW8,$AX8))","v":false},{"$f":"IF($B8=\"Sa\",IF($H8<>\"\",$H8,TIME(0,0,0)),IF($AL8,IF(AND($H8<>\"\",$H8>$AF8),$H8,$AF8),\"\"))","v":"00:00:00"},{"$f":"IF($AL8,IF($M8<>\"\",$M8,$BC8),\"\")","v":"23:59:00"},{"$f":"IF($B8=\"Sa\",IF($L8=\"\",TIME(0,0,0),$L8),IF($AL8,IF($L8<>\"\",$L8,IF(AND($H8<>\"\",$H8>$AF8),$H8,$AF8)),\"\"))","v":"00:00:00"},{"$f":"IF($AL8,TIME(23,59,0),\"\")","v":"23:59:00"},{"$f":"MOD($L8*24,0.25)=0","v":true},{"$f":"AND($AL8,ISNUMBER($L8),$L8>=$AZ8,$BA8>=$L8)","v":false},{"$f":"MOD($M8*24,0.25)=0","v":true},{"$f":"AND($AL8,ISNUMBER($M8),$M8>=$BB8,$M8<=$BC8)","v":false},{"$f":"IF(AND(ISBLANK($D8),ISBLANK($G8),ISBLANK($H8),ISBLANK($L8),ISBLANK($M8),ISBLANK($P8)),0,1)","v":0}]
[{"$f":"IF($R9,$Q9,\"\")","v":"2023-04-02"},"So"," Palmsonntag",null,{"$f":"IF(AND($R9,$T9<>\"F\"),IF($AC9=$AF9,\"keine NAZ\",TEXT($AC9,\"hh:mm\")&\"-\"&TEXT($AF9,\"hh:mm\")),\"\")","v":""},"00:00:00",null,null,"",0,{"$f":"IF(AND($U9=\"F\",$AM9),ROUND($V9*24,2),\"\")","v":""},null,null,"",null,null,{"$f":" Q8+1","v":"2023-04-02"},true,"","F","F",0,0,0,true,false,false,"","","","","","",false,{"$f":"AND($T9<>\"F\",NOT($AH9),NOT($AC9=$AF9))","v":false},false,true,{"$f":"AND(Zeitmodus=C_Gleitzeit,$U9<>\"F\",OR($B9=\"Sa\",AND($AM9,$I9>=0,NOT($AY9))))","v":false},false,{"$f":"OR($K9<>\"\",AND($L9<>\"\",$M9<>\"\"))","v":false},"00:00:00","23:59:00",{"$f":"IF($AK9,IF($G9=\"\",TagUG,$G9),\"\")","v":"00:00:00"},"23:59:00",true,false,true,false,false,false,{"$f":"AND($U9<>\"F\",OR($AW9,$AX9))","v":false},"","","","",true,false,true,false,0]
["2023-04-03","Mo"," ",null,"08:00-16:00","08:00:00",null,null,"",0,"",null,null,"",null,null,"2023-04-03",true,"","A","A",0,-0.33333333333333298,0,false,false,true,"07:00:00","08:00:00","09:00:00","14:00:00","16:00:00","18:00:00",false,true,false,true,false,false,false,"00:00:00","23:59:00","00:00:00","23:59:00",true,false,true,false,false,false,false,"","","","",true,false,true,false,0]
["2023-04-04","Di"," ",null,"08:00-16:00","08:00:00",null,null,"",0,"",null,null,"",null,null,"2023-04-04",true,"","A","A",0,-0.33333333333333298,0,false,false,true,"07:00:00","08:00:00","09:00:00","14:00:00","16:00:00","18:00:00",false,true,false,true,false,false,false,"00:00:00","23:59:00","00:00:00","23:59:00",true,false,true,false,false,false,false,"","","","",true,false,true,false,0]
["2023-04-05","Mi"," ",null,"08:00-16:00","08:00:00",null,null,"",0,"",null,null,"",null,null,"2023-04-05",true,"","A","A",0,-0.33333333333333298,0,false,false,true,"07:00:00","08:00:00","09:00:00","14:00:00","16:00:00","18:00:00",false,true,false,true,false,false,false,"00:00:00","23:59:00","00:00:00","23:59:00",true,false,true,false,false,false,false,"","","","",true,false,true,false,0]
["2023-04-06","Do"," Gründonnerstag",null,"08:00-16:00","08:00:00",null,null,"",0,"",null,null,"",null,null,"2023-04-06",true,"","A","A",0,-0.33333333333333298,0,false,false,true,"07:00:00","08:00:00","09:00:00","14:00:00","16:00:00","18:00:00",false,true,false,true,false,false,false,"00:00:00","23:59:00","00:00:00","23:59:00",true,false,true,false,false,false,false,"","","","",true,false,true,false,0]
["2023-04-07","Fr"," Karfreitag",null,"08:00-16:00","08:00:00",null,null,"",0,"",null,null,"",null,null,"2023-04-07",true,"","A","A",0,-0.33333333333333298,0,false,false,true,"07:00:00","08:00:00","09:00:00","12:00:00","16:00:00","18:00:00",false,true,false,true,false,false,false,"00:00:00","23:59:00","00:00:00","23:59:00",true,false,true,false,false,false,false,"","","","",true,false,true,false,0]
["2023-04-08","Sa"," Wochenende",null,"","00:00:00",null,null,"",0,"",null,null,"",null,null,"2023-04-08",true,"","F","A",0,0,0,true,false,false,"","","","","","",false,false,false,true,true,false,false,"00:00:00","23:59:00","00:00:00","23:59:00",true,false,true,false,false,false,false,"00:00:00","23:59:00","00:00:00","23:59:00",true,false,true,false,0]
["2023-04-09","So"," Ostersonntag",null,"","00:00:00",null,null,"",0,"",null,null,"",null,null,"2023-04-09",true,"","F","F",0,0,0,true,false,false,"","","","","","",false,false,false,true,false,false,false,"00:00:00","23:59:00","00:00:00","23:59:00",true,false,true,false,false,false,false,"","","","",true,false,true,false,0]
["2023-04-10","Mo"," Ostermontag",null,"","00:00:00",null,null,"",0,"",null,null,"",null,null,"2023-04-10",true,"","F","F",0,0,0,true,false,false,"07:00:00","08:00:00","09:00:00","14:00:00","16:00:00","18:00:00",false,false,false,true,false,false,false,"00:00:00","23:59:00","00:00:00","23:59:00",true,false,true,false,false,false,false,"","","","",true,false,true,false,0]
["2023-04-11","Di"," Osterdienstag",null,"08:00-16:00","08:00:00",null,null,"",0,"",null,null,"",null,null,"2023-04-11",true,"","A","A",0,-0.33333333333333298,0,false,false,true,"07:00:00","08:00:00","09:00:00","14:00:00","16:00:00","18:00:00",false,true,false,true,false,false,false,"00:00:00","23:59:00","00:00:00","23:59:00",true,false,true,false,false,false,false,"","","","",true,false,true,false,0]
["2023-04-12","Mi"," ",null,"08:00-16:00","08:00:00",null,null,"",0,"",null,null,"",null,null,"2023-04-12",true,"","A","A",0,-0.33333333333333298,0,false,false,true,"07:00:00","08:00:00","09:00:00","14:00:00","16:00:00","18:00:00",false,true,false,true,false,false,false,"00:00:00","23:59:00","00:00:00","23:59:00",true,false,true,false,false,false,false,"","","","",true,false,true,false,0]
["2023-04-13","Do"," ",null,"08:00-16:00","08:00:00",null,null,"",0,"",null,null,"",null,null,"2023-04-13",true,"","A","A",0,-0.33333333333333298,0,false,false,true,"07:00:00","08:00:00","09:00:00","14:00:00","16:00:00","18:00:00",false,true,false,true,false,false,false,"00:00:00","23:59:00","00:00:00","23:59:00",true,false,true,false,false,false,false,"","","","",true,false,true,false,0]
["2023-04-14","Fr"," ",null,"08:00-16:00","08:00:00",null,null,"",0,"",null,null,"",null,null,"2023-04-14",true,"","A","A",0,-0.33333333333333298,0,false,false,true,"07:00:00","08:00:00","09:00:00","12:00:00","16:00:00","18:00:00",false,true,false,true,false,false,false,"00:00:00","23:59:00","00:00:00","23:59:00",true,false,true,false,false,false,false,"","","","",true,false,true,false,0]
["2023-04-15","Sa"," Wochenende",null,"","00:00:00",null,null,"",0,"",null,null,"",null,null,"2023-04-15",true,"","F","A",0,0,0,true,false,false,"","","","","","",false,false,false,true,true,false,false,"00:00:00","23:59:00","00:00:00","23:59:00",true,false,true,false,false,false,false,"00:00:00","23:59:00","00:00:00","23:59:00",true,false,true,false,0]
["2023-04-16","So"," Wochenende",null,"","00:00:00",null,null,"",0,"",null,null,"",null,null,"2023-04-16",true,"","F","F",0,0,0,true,false,false,"","","","","","",false,false,false,true,false,false,false,"00:00:00","23:59:00","00:00:00","23:59:00",true,false,true,false,false,false,false,"","","","",true,false,true,false,0]
["2023-04-17","Mo"," ",null,"08:00-16:00","08:00:00",null,null,"",0,"",null,null,"",null,null,"2023-04-17",true,"","A","A",0,-0.33333333333333298,0,false,false,true,{"$f":"IF(ISNA(VLOOKUP($B24,GAZ,AB$7,FALSE)),\"\",VLOOKUP($B24,GAZ,AB$7,FALSE))","v":"07:00:00"},"08:00:00","09:00:00","14:00:00","16:00:00","18:00:00",false,true,false,true,false,false,false,"00:00:00","23:59:00","00:00:00","23:59:00",true,false,true,false,false,false,false,"","","","",true,false,true,false,0]
["2023-04-18","Di"," ",null,"08:00-16:00","08:00:00",null,null,"",0,"",null,null,"",null,null,"2023-04-18",true,"","A","A",0,-0.33333333333333298,0,false,false,true,"07:00:00","08:00:00","09:00:00","14:00:00","16:00:00","18:00:00",false,true,false,true,false,false,false,"00:00:00","23:59:00","00:00:00","23:59:00",true,false,true,false,false,false,false,"","","","",true,false,true,false,0]
["2023-04-19","Mi"," ",null,"08:00-16:00","08:00:00",null,null,"",0,"",null,null,"",null,null,"2023-04-19",true,"","A","A",0,-0.33333333333333298,0,false,false,true,"07:00:00","08:00:00","09:00:00","14:00:00","16:00:00","18:00:00",false,true,false,true,false,false,false,"00:00:00","23:59:00","00:00:00","23:59:00",true,false,true,false,false,false,false,"","","","",true,false,true,false,0]
["2023-04-20","Do"," ",null,"08:00-16:00","08:00:00",null,null,"",0,"",null,null,"",null,null,"2023-04-20",true,"","A","A",0,-0.33333333333333298,0,false,false,true,"07:00:00","08:00:00","09:00:00","14:00:00","16:00:00","18:00:00",false,true,false,true,false,false,false,"00:00:00","23:59:00","00:00:00","23:59:00",true,false,true,false,false,false,false,"","","","",true,false,true,false,0]
["2023-04-21","Fr"," ",null,"08:00-16:00","08:00:00",null,null,"",0,"",null,null,"",null,null,"2023-04-21",true,"","A","A",0,-0.33333333333333298,0,false,false,true,"07:00:00","08:00:00","09:00:00","12:00:00","16:00:00","18:00:00",false,true,false,true,false,false,false,"00:00:00","23:59:00","00:00:00","23:59:00",true,false,true,false,false,false,false,"","","","",true,false,true,false,0]
["2023-04-22","Sa"," Wochenende",null,"","00:00:00",null,null,"",0,"",null,null,"",null,null,"2023-04-22",true,"","F","A",0,0,0,true,false,false,"","","","","","",false,false,false,true,true,false,false,"00:00:00","23:59:00","00:00:00","23:59:00",true,false,true,false,false,false,false,"00:00:00","23:59:00","00:00:00","23:59:00",true,false,true,false,0]
["2023-04-23","So"," Wochenende",null,"","00:00:00",null,null,"",0,"",null,null,"",null,null,"2023-04-23",true,"","F","F",0,0,0,true,false,false,"","","","","","",false,false,false,true,false,false,false,"00:00:00","23:59:00","00:00:00","23:59:00",true,false,true,false,false,false,false,"","","","",true,false,true,false,0]
["2023-04-24","Mo"," ",null,"08:00-16:00","08:00:00",null,null,"",0,"",null,null,"",null,null,"2023-04-24",true,"","A","A",0,-0.33333333333333298,0,false,false,true,"07:00:00","08:00:00","09:00:00","14:00:00","16:00:00","18:00:00",false,true,false,true,false,false,false,"00:00:00","23:59:00","00:00:00","23:59:00",true,false,true,false,false,false,false,"","","","",true,false,true,false,0]
["2023-04-25","Di"," ",null,"08:00-16:00","08:00:00",null,null,"",0,"",null,null,"",null,null,"2023-04-25",true,"","A","A",0,-0.33333333333333298,0,false,false,true,"07:00:00","08:00:00","09:00:00","14:00:00","16:00:00","18:00:00",false,true,false,true,false,false,false,"00:00:00","23:59:00","00:00:00","23:59:00",true,false,true,false,false,false,false,"","","","",true,false,true,false,0]
["2023-04-26","Mi"," ",null,"08:00-16:00","08:00:00",null,null,"",0,"",null,null,"",null,null,"2023-04-26",true,"","A","A",0,-0.33333333333333298,0,false,false,true,"07:00:00","08:00:00","09:00:00","14:00:00","16:00:00","18:00:00",false,true,false,true,false,false,false,"00:00:00","23:59:00","00:00:00","23:59:00",true,false,true,false,false,false,false,"","","","",true,false,true,false,0]
["2023-04-27","Do"," ",null,"08:00-16:00","08:00:00",null,null,"",0,"",null,null,"",null,null,"2023-04-27",true,"","A","A",0,-0.33333333333333298,0,false,false,true,"07:00:00","08:00:00","09:00:00","14:00:00","16:00:00","18:00:00",false,true,false,true,false,false,false,"00:00:00","23:59:00","00:00:00","23:59:00",true,false,true,false,false,false,false,"","","","",true,false,true,false,0]
["2023-04-28","Fr"," ",null,"08:00-16:00","08:00:00",null,null,"",0,"",null,null,"",null,null,"2023-04-28",true,"","A","A",0,-0.33333333333333298,0,false,false,true,"07:00:00","08:00:00","09:00:00","12:00:00","16:00:00","18:00:00",false,true,false,true,false,false,false,"00:00:00","23:59:00","00:00:00","23:59:00",true,false,true,false,false,false,false,"","","","",true,false,true,false,0]
["2023-04-29","Sa"," Wochenende",null,"","00:00:00",null,null,"",0,"",null,null,"",null,null,"2023-04-29",true,"","F","A",0,0,0,true,false,false,"","","","","","",false,false,false,true,true,false,false,"00:00:00","23:59:00","00:00:00","23:59:00",true,false,true,false,false,false,false,"00:00:00","23:59:00","00:00:00","23:59:00",true,false,true,false,0]
["2023-04-30","So"," Wochenende",null,"","00:00:00",null,null,"",0,"",null,null,"",null,null,"2023-04-30",true,"","F","F",0,0,0,true,false,false,"","","","","","",false,false,false,true,false,false,false,"00:00:00","23:59:00","00:00:00","23:59:00",true,false,true,false,false,false,false,"","","","",true,false,true,false,0]
["","","",null,"","",null,null,"",{"$f":"IF($R38,$X38,\"\")","v":""},"",null,null,"",null,null,"2023-05-01",false,"","","",0,"",0,false,true,false,"","","","","","",false,false,false,false,false,false,false,"","","","",true,false,true,false,false,false,false,"","","","",true,false,true,false,0]
["Arbeitstage",{"$f":"COUNTIF(T$8:T$38,\"A\")","v":19},null,null,{"$f":"\"Saldo Monat (~15min) > \"","v":"Saldo Monat (~15min) > "},null,null,null,{"$f":"ROUND(SUM(I8:I38)*4,0)/4","v":0},null,{"$f":"SUM(K8:K38)","v":0}," < ÜS1:2",null,{"$f":"SUM(N8:N38)","v":0},{"$f":"IF(Zeitmodell=\"Vollzeit\",\" < ÜS1:1,5 \",\" < ÜS1:1,25 \")&Zeitmodell","v":" < ÜS1:1,5 Vollzeit"},null,"Zeitmodell Text"]
["Freie Tage",{"$f":"COUNTIF(T$8:T$38,\"F\")","v":11},null,null,{"$f":"\"Saldo \"&IF(Zeitmodell=\"Vollzeit\",\"1:1,5\",\"1:1,25\")& \" (~15min) > \"","v":"Saldo 1:1,5 (~15min) > "},null,null,null,{"$f":"ROUND($N40*4,0)/4","v":0},null,null,null,null,{"$f":"IF(Zeitmodell=\"Vollzeit\",$N39*1.5,$N39*1.25)","v":0},{"$f":"IF(Zeitmodell=\"Vollzeit\",\" < 1:1,5 \",\" < 1:1,25 \")&$Q40","v":" < 1:1,5 Stunden berechnen"},null,"Stunden berechnen"]
["ZK-Tage",0,null,null,"Saldo 1:2 (~15min) > ",null,null,null,{"$f":"ROUND($N41*4,0)/4","v":0},null,null,null,null,{"$f":"K39*2","v":0}," < 1:2    Stunden berechnen"]
["ZA-Tage",{"$f":"COUNTIF(D$8:D$38,\"Z\")","v":0},null,null," Saldo Vormonat > ",null,null,null,{"$f":"$J5","v":0},null,null,null,null,null,null,null,"Gültigkeit ausbezahlt"]
["Urlaubstage",{"$f":"COUNTIF(D$8:D$38,\"U\")","v":0},null,null," Saldo Gesamt > ",null,null,null,{"$f":"SUM(I39:I42)","v":0},null,{"$f":"IF($I$43>=$R$2,\"< Hier ausbezahlte Std. eingeben. (Die Eingabe ist hier erst ab   < einem Saldo von \"&TEXT($R$2,\"#.##0,00\")&\" Std., und nur in 0,25-Schritten möglich.)\",\"\")","v":""},null,null,null,null,null,{"$f":"IF(AND($J$43<>\"\",NOT(ISNUMBER($J$43))),FALSE,OR(AND($J$43>=0,$J$43<=$I$43,MOD($J$43,0.25)=0),$J$43=\"\"))","v":true}]
["Krank",{"$f":"COUNTIF(D$8:D$38,\"K\")","v":0},null,null," Saldo Übertrag > ",null,null,null,{"$f":"$I43-$J43","v":0},{"$f":"\" < Dieser Stunden-Saldo wird in das nächste \"&IF($Q$3=\"Dezember\",\"Jahr\",\"Monat\")&\" übertragen\"","v":" < Dieser Stunden-Saldo wird in das nächste Monat übertragen"}]
[null,null,null,"Z"]
[]
[]
[{"$f":"\"Unterschrift von \"&Vorgesetzter","v":"Unterschrift von Vorname Nachname"},null,null,null,null,null,null,null,null,null,null,{"$f":"\"Unterschrift von \"&Name","v":"Unterschrift von Vorname Nachname"}]

{"sheet":"Mai","index":5,"n_rows":48,"n_cols":60,"rows_kept":48,"cut":false,"hidden":true,"merged":[[47,0,47,3],[47,11,47,15],[42,4,42,7],[42,10,42,15],[43,4,43,7],[44,4,44,7],[45,4,45,7],[46,4,46,7],[38,2,43,3],[38,4,38,7],[38,11,38,12],[38,14,38,15],[39,4,39,7],[39,14,39,15],[40,4,40,7],[40,14,40,15],[41,4,41,7],[41,10,41,15],[5,7,6,7],[5,10,6,10],[5,11,6,11],[5,12,6,12],[5,13,6,13],[5,27,5,32],[4,2,4,3],[4,4,4,5],[5,2,6,2],[5,3,6,3],[5,5,6,5],[5,6,6,6],[0,15,1,15],[1,5,1,7],[2,5,2,7],[3,0,3,3],[3,4,3,5],[3,6,4,8],[3,14,6,14],[3,15,6,15],[4,0,6,0],[4,1,6,1]]}
[" BOKU-Zeiterfassung für Allgemeines Personal",null,null,null,null,null,null,null,null,null,null,null,null,null,null,null,"Monat","Stunden-Saldo Grenzen","Status Blatteingabe"]
[{"$f":"\" Org.-Einh. : \"&OrgEinheit","v":" Org.-Einh. : HXXXXX"},null,null,null,null,"Zeitmodell:",null,null,{"$f":"\" \"&Zeitmodell","v":" Vollzeit"},"Modus:",{"$f":"\" \"&Zeitmodus","v":" Gleitzeit"},null,null,null,null,null,{"$f":"IF(ISNA($Q$4),1,$Q$4)","v":5},{"$f":"IF($Q$2=12,NormalOGDez,NormalOG)","v":71.999999999999986},{"$f":"SUM($BH8:$BH38)","v":0}]
[{"$f":" \" Mitarbeiter/in: \"&Name","v":" Mitarbeiter/in: Vorname Nachname"},null,null,null,null,"Vorgesetzte/r:",null,null,{"$f":"\" \"&Vorgesetzter","v":" Vorname Nachname"},null,null,null,null,null,null,null,{"$f":"RIGHT(CELL(\"filename\",A1),LEN(CELL(\"filename\",A1))-SEARCH(\"]\",CELL(\"filename\",A1),1))","v":"Mai"},{"$f":"IF($Q$2=12,NormalUGDez,NormalUG)","v":-24},{"$f":"IF($Q$2=1,$S$2,$S$2+INDIRECT($S$5))","v":0}]
[{"$f":" \" Monat: \"&$Q$3&\" \"&Jahr","v":" Monat: Mai 2023"},null,null,null,"Dienstplan",null,"Normalstunden Feiertag-ÜS1:2",null,null,"Übertrag","Überstundenberechnung",null,null,null," Unterschrift des\n Vorgesetzten","Anmerkungen \n(z.B. Überstunden- notwendigkeit)",{"$f":"IF(ISNA(VLOOKUP($Q$3,MTab,2,FALSE)),1,VLOOKUP($Q$3,MTab,2,FALSE))","v":5},null,"Übertrags Adresse Blatteingabe"]
[" Datum","Wochentag","Tagesinformationen",null,{"$f":"\"Wochen-AZ\"&\" \"&TEXT(WAZ,\"[hh]:mm\")","v":"Wochen-AZ 40:00"},null,null,null,null,{"$f":"IF(ISNA($Q$5),Übertrag,INDIRECT($Q$5))","v":0},"ÜS1:2",{"$f":"IF(Zeitmodell=\"Vollzeit\",\" Überstunden1:1,5\",\" Überstunden1:1,25\")","v":" Überstunden1:1,5"},null,null,null,null,{"$f":"IF(ISNA(VLOOKUP($Q$3,MTab,3,FALSE)),\"Übertrag\",VLOOKUP($Q$3,MTab,3,FALSE))","v":"April!$I$44"},null,{"$f":"IF(ISNA(VLOOKUP($Q$3,MTab,4,FALSE)),$Q$3&\"!$S$2\",VLOOKUP($Q$3,MTab,4,FALSE))","v":"April!$S$3"}]
[null,null," Feiertage\n Wochenende\n Urlaub, ZA, Krank","[U]rlaub\n[Z]A\n[ZK]\n[K]rank","Normal-","Soll","Von","Bis","Plus","Saldo","Plus","Von","Bis","Plus",null,null,"Hintergrundberechnungen",null,null,null,null,null,null,"Saldo aktuell",null,null,null,"GAZ-Tabellenabbildung",null,null,null,null,null,"Eingabebeprüfungen"]
[null,null,null,null,"Arbeitszeit",null,null,null,"Minus","akuell",null,null,null,null,null,null,"Datum","Monat OK","Abwesenh.","Freie Tage","ÜA-Tage","Std.","Soll-Std.",{"$f":"IF(ISNA($Q$5),Übertrag,INDIRECT($Q$5))","v":0},"Std.-Soll = 0","Std.-Soll > 0","Std.-Soll < 0",{"$f":"I_GAZGRVon","v":2},{"$f":"I_GAZNAZVon","v":3},{"$f":"I_GAZKVon","v":4},{"$f":"I_GAZKBis","v":6},{"$f":"I_GAZNAZBis","v":7},{"$f":"I_GAZGRBis","v":8},"Zeiteingabe","UZK-Eing.\nerlaubt","UZK-Eing.\ngültig","Normalst. ein erlaubt","Überstd. ein erlaubt","Normalstd.\neingegeben","Überstd.\neingegeben","Normal VON möglich OG","Normal VON möglich UG","Normal BIS möglich OG","Normal BIS möglich UG","Normal VON\n15min","Normal VON richtig","Normal BIS\n15min","Normal BIS richtig","ZA-Kern Von","ZA-Kern Bis","ZA-Kern","Über VON Obergrenze","Über VON Untergrenze","Über BIS Obergrenze","Über BIS Untergrenze","Über VON\n15min","Über VON richtig","Überl BIS\n15min","Über BIS richtig","Status Zeilen Eingabe"]
[{"$f":"IF($R8,$Q8,\"\")","v":"2023-05-01"},{"$f":"IF($R8,VLOOKUP(WEEKDAY($Q8,2),WOTA,2,FALSE),\"\")","v":"Mo"},{"$f":"IF($R8,\" \"&IF($S8=\"\",VLOOKUP($Q8,FListe,3,FALSE),$S8),\"\")","v":" Staatsfeiertag"},null,{"$f":"IF(AND($R8,$T8<>\"F\"),IF($AC8=$AF8,\"keine NAZ\",TEXT($AC8,\"hh:mm\")&\"-\"&TEXT($AF8,\"hh:mm\")),\"\")","v":""},{"$f":"IF($R8,IF($T8=\"F\",0,VLOOKUP($B8,GAZ,I_GAZNAZ,FALSE)),\"\")","v":"00:00:00"},null,null,{"$f":"IF(Zeitmodus=\"Gleitzeit\",IF($U8=\"F\",\"\",IF(AND($R8,$AM8,NOT($Y8)),ROUND(($V8-$F8)*24,2),IF($D8=\"Z\",$F8*-24,\"\"))),IF(OR($D8=\"Z\",AND($AM8,$U8=\"A\",W8<0)),ROUND($W8*24,2),\"\"))","v":""},{"$f":"IF($R8,$X8,\"\")","v":0},{"$f":"IF(AND($U8=\"F\",$AM8),ROUND($V8*24,2),\"\")","v":""},null,null,{"$f":"IF(Zeitmodus=\"Gleitzeit\",IF(AND($R8,$AN8,$M8-$L8<>0,$AL8),ROUND(($M8-$L8)*24,2),\"\"),IF(AND($AM8,$U8=\"A\",W8>0),ROUND(W8*24,2),\"\"))","v":""},null,null,{"$f":"DATE(Jahr,$Q2,1)","v":"2023-05-01"},{"$f":"$Q$2=MONTH($Q8)","v":true},{"$f":"IF(OR($D8=\"U\",$D8=\"Z\",$D8=\"ZK\",$D8=\"K\"),VLOOKUP($D8,UZK,2,FALSE),\"\")","v":""},{"$f":"IF($R8,VLOOKUP($Q8,FListe,4,FALSE),\"\")","v":"F"},{"$f":"IF($R8,VLOOKUP($Q8,FListe,5,FALSE),\"\")","v":"F"},{"$f":"$H8-$G8","v":0},{"$f":"IF($R8,ROUND($V8-$F8,15),\"\")","v":0},{"$f":"IF($I8<>\"\",$X7+$I8,$X7)","v":0},{"$f":"($W8=0)","v":true},{"$f":"($W8>0)","v":false},{"$f":"($W8<0)","v":false},{"$f":"IF(ISNA(VLOOKUP($B8,GAZ,AB$7,FALSE)),\"\",VLOOKUP($B8,GAZ,AB$7,FALSE))","v":"07:00:00"},"08:00:00",{"$f":"IF(ISNA(VLOOKUP($B8,GAZ,AD$7,FALSE)),\"\",IF($AC8=$AF8,$G8,VLOOKUP($B8,GAZ,AD$7,FALSE)))","v":"09:00:00"},{"$f":"IF(ISNA(VLOOKUP($B8,GAZ,AE$7,FALSE)),\"\",IF($AC8=$AF8,$H8,VLOOKUP($B8,GAZ,AE$7,FALSE)))","v":"14:00:00"},"16:00:00","18:00:00",{"$f":"OR($G8<>\"\",$H8<>\"\",$L8<>\"\",$M8<>\"\")","v":false},{"$f":"AND($T8<>\"F\",NOT($AH8),NOT($AC8=$AF8))","v":false},{"$f":"AND($AI8,OR($D8=\"U\",$D8=\"Z\",$D8=\"K\"))","v":false},{"$f":"AND($D8<>\"U\",$D8<>\"Z\",$D8<>\"K\",$R8)","v":true},{"$f":"AND(Zeitmodus=C_Gleitzeit,$U8<>\"F\",OR($B8=\"Sa\",AND($AM8,$I8>=0,NOT($AY8))))","v":false},{"$f":"AND($G8<>\"\",$H8<>\"\")","v":false},{"$f":"OR($K8<>\"\",AND($L8<>\"\",$M8<>\"\"))","v":false},{"$f":"IF($AK8,TagUG,\"\")","v":"00:00:00"},{"$f":"IF($AK8,IF($H8=\"\",IF(AND($L8<>\"\",$L8<$AG8),$L8,IF(AND($M8<>\"\",$M8<$AG8),$M8,TagOG)),$H8),\"\")","v":"23:59:00"},{"$f":"IF($AK8,IF($G8=\"\",$AB8,$G8),\"\")","v":"07:00:00"},{"$f":"IF($AK8,IF(AND($L8<>\"\",$L8<$AG8),$L8,IF(AND($M8<>\"\",$M8<$AG8),$M8,TagOG)),\"\")","v":"23:59:00"},{"$f":"MOD($G8*24,0.25)=0","v":true},{"$f":"AND($AK8,ISNUMBER($G8),$G8>=$AO8,$G8<=$AP8)","v":false},{"$f":"MOD($H8*24,0.25)=0","v":true},{"$f":"AND($AK8,ISNUMBER($H8),$H8>=$AQ8,$H8<=$AR8)","v":false},{"$f":"AND(Zeitmodus=C_Gleitzeit,$B8<>\"Sa\",$G8<>\"\",$G8>$AD8)","v":false},{"$f":"AND(Zeitmodus=C_Gleitzeit,$B8<>\"Sa\",$H8<>\"\",$H8<$AE8)","v":false},{"$f":"AND($U8<>\"F\",OR($AW8,$AX8))","v":false},{"$f":"IF($B8=\"Sa\",IF($H8<>\"\",$H8,TIME(0,0,0)),IF($AL8,IF(AND($H8<>\"\",$H8>$AF8),$H8,$AF8),\"\"))","v":""},{"$f":"IF($AL8,IF($M8<>\"\",$M8,$BC8),\"\")","v":""},{"$f":"IF($B8=\"Sa\",IF($L8=\"\",TIME(0,0,0),$L8),IF($AL8,IF($L8<>\"\",$L8,IF(AND($H8<>\"\",$H8>$AF8),$H8,$AF8)),\"\"))","v":""},{"$f":"IF($AL8,TIME(23,59,0),\"\")","v":""},{"$f":"MOD($L8*24,0.25)=0","v":true},{"$f":"AND($AL8,ISNUMBER($L8),$L8>=$AZ8,$BA8>=$L8)","v":false},{"$f":"MOD($M8*24,0.25)=0","v":true},{"$f":"AND($AL8,ISNUMBER($M8),$M8>=$BB8,$M8<=$BC8)","v":false},{"$f":"IF(AND(ISBLANK($D8),ISBLANK($G8),ISBLANK($H8),ISBLANK($L8),ISBLANK($M8),ISBLANK($P8)),0,1)","v":0}]
[{"$f":"IF($R9,$Q9,\"\")","v":"2023-05-02"},"Di"," ",null,{"$f":"IF(AND($R9,$T9<>\"F\"),IF($AC9=$AF9,\"keine NAZ\",TEXT($AC9,\"hh:mm\")&\"-\"&TEXT($AF9,\"hh:mm\")),\"\")","v":"08:00-16:00"},"08:00:00",null,null,"",0,{"$f":"IF(AND($U9=\"F\",$AM9),ROUND($V9*24,2),\"\")","v":""},null,null,"",null,null,{"$f":" Q8+1","v":"2023-05-02"},true,"","A","A",0,-0.33333333333333298,0,false,false,true,"07:00:00","08:00:00","09:00:00","14:00:00","16:00:00","18:00:00",false,{"$f":"AND($T9<>\"F\",NOT($AH9),NOT($AC9=$AF9))","v":true},false,true,{"$f":"AND(Zeitmodus=C_Gleitzeit,$U9<>\"F\",OR($B9=\"Sa\",AND($AM9,$I9>=0,NOT($AY9))))","v":false},false,{"$f":"OR($K9<>\"\",AND($L9<>\"\",$M9<>\"\"))","v":false},"00:00:00","23:59:00",{"$f":"IF($AK9,IF($G9=\"\",TagUG,$G9),\"\")","v":"00:00:00"},"23:59:00",true,false,true,false,false,false,{"$f":"AND($U9<>\"F\",OR($AW9,$AX9))","v":false},"","","","",true,false,true,false,0]
["2023-05-03","Mi"," ",null,"08:00-16:00","08:00:00",null,null,"",0,"",null,null,"",null,null,"2023-05-03",true,"","A","A",0,-0.33333333333333298,0,false,false,true,"07:00:00","08:00:00","09:00:00","14:00:00","16:00:00","18:00:00",false,true,false,true,false,false,false,"00:00:00","23:59:00","00:00:00","23:59:00",true,false,true,false,false,false,false,"","","","",true,false,true,false,0]
["2023-05-04","Do"," ",null,"08:00-16:00","08:00:00",null,null,"",0,"",null,null,"",null,null,"2023-05-04",true,"","A","A",0,-0.33333333333333298,0,false,false,true,"07:00:00","08:00:00","09:00:00","14:00:00","16:00:00","18:00:00",false,true,false,true,false,false,false,"00:00:00","23:59:00","00:00:00","23:59:00",true,false,true,false,false,false,false,"","","","",true,false,true,false,0]
["2023-05-05","Fr"," ",null,"08:00-16:00","08:00:00",null,null,"",0,"",null,null,"",null,null,"2023-05-05",true,"","A","A",0,-0.33333333333333298,0,false,false,true,"07:00:00","08:00:00","09:00:00","12:00:00","16:00:00","18:00:00",false,true,false,true,false,false,false,"00:00:00","23:59:00","00:00:00","23:59:00",true,false,true,false,false,false,false,"","","","",true,false,true,false,0]
["2023-05-06","Sa"," Wochenende",null,"","00:00:00",null,null,"",0,"",null,null,"",null,null,"2023-05-06",true,"","F","A",0,0,0,true,false,false,"","","","","","",false,false,false,true,true,false,false,"00:00:00","23:59:00","00:00:00","23:59:00",true,false,true,false,false,false,false,"00:00:00","23:59:00","00:00:00","23:59:00",true,false,true,false,0]
["2023-05-07","So"," Wochenende",null,"","00:00:00",null,null,"",0,"",null,null,"",null,null,"2023-05-07",true,"","F","F",0,0,0,true,false,false,"","","","","","",false,false,false,true,false,false,false,"00:00:00","23:59:00","00:00:00","23:59:00",true,false,true,false,false,false,false,"","","","",true,false,true,false,0]
["2023-05-08","Mo"," ",null,"08:00-16:00","08:00:00",null,null,"",0,"",null,null,"",null,null,"2023-05-08",true,"","A","A",0,-0.33333333333333298,0,false,false,true,"07:00:00","08:00:00","09:00:00","14:00:00","16:00:00","18:00:00",false,true,false,true,false,false,false,"00:00:00","23:59:00","00:00:00","23:59:00",true,false,true,false,false,false,false,"","","","",true,false,true,false,0]
["2023-05-09","Di"," ",null,"08:00-16:00","08:00:00",null,null,"",0,"",null,null,"",null,null,"2023-05-09",true,"","A","A",0,-0.33333333333333298,0,false,false,true,"07:00:00","08:00:00","09:00:00","14:00:00","16:00:00","18:00:00",false,true,false,true,false,false,false,"00:00:00","23:59:00","00:00:00","23:59:00",true,false,true,false,false,false,false,"","","","",true,false,true,false,0]
["2023-05-10","Mi"," ",null,"08:00-16:00","08:00:00",null,null,"",0,"",null,null,"",null,null,"2023-05-10",true,"","A","A",0,-0.33333333333333298,0,false,false,true,"07:00:00","08:00:00","09:00:00","14:00:00","16:00:00","18:00:00",false,true,false,true,false,false,false,"00:00:00","23:59:00","00:00:00","23:59:00",true,false,true,false,false,false,false,"","","","",true,false,true,false,0]
["2023-05-11","Do"," ",null,"08:00-16:00","08:00:00",null,null,"",0,"",null,null,"",null,null,"2023-05-11",true,"","A","A",0,-0.33333333333333298,0,false,false,true,"07:00:00","08:00:00","09:00:00","14:00:00","16:00:00","18:00:00",false,true,false,true,false,false,false,"00:00:00","23:59:00","00:00:00","23:59:00",true,false,true,false,false,false,false,"","","","",true,false,true,false,0]
["2023-05-12","Fr"," ",null,"08:00-16:00","08:00:00",null,null,"",0,"",null,null,"",null,null,"2023-05-12",true,"","A","A",0,-0.33333333333333298,0,false,false,true,"07:00:00","08:00:00","09:00:00","12:00:00","16:00:00","18:00:00",false,true,false,true,false,false,false,"00:00:00","23:59:00","00:00:00","23:59:00",true,false,true,false,false,false,false,"","","","",true,false,true,false,0]
["2023-05-13","Sa"," Wochenende",null,"","00:00:00",null,null,"",0,"",null,null,"",null,null,"2023-05-13",true,"","F","A",0,0,0,true,false,false,"","","","","","",false,false,false,true,true,false,false,"00:00:00","23:59:00","00:00:00","23:59:00",true,false,true,false,false,false,false,"00:00:00","23:59:00","00:00:00","23:59:00",true,false,true,false,0]
["2023-05-14","So"," Muttertag",null,"","00:00:00",null,null,"",0,"",null,null,"",null,null,"2023-05-14",true,"","F","F",0,0,0,true,false,false,"","","","","","",false,false,false,true,false,false,false,"00:00:00","23:59:00","00:00:00","23:59:00",true,false,true,false,false,false,false,"","","","",true,false,true,false,0]
["2023-05-15","Mo"," ",null,"08:00-16:00","08:00:00",null,null,"",0,"",null,null,"",null,null,"2023-05-15",true,"","A","A",0,-0.33333333333333298,0,false,false,true,"07:00:00","08:00:00","09:00:00","14:00:00","16:00:00","18:00:00",false,true,false,true,false,false,false,"00:00:00","23:59:00","00:00:00","23:59:00",true,false,true,false,false,false,false,"","","","",true,false,true,false,0]
["2023-05-16","Di"," ",null,"08:00-16:00","08:00:00",null,null,"",0,"",null,null,"",null,null,"2023-05-16",true,"","A","A",0,-0.33333333333333298,0,false,false,true,"07:00:00","08:00:00","09:00:00","14:00:00","16:00:00","18:00:00",false,true,false,true,false,false,false,"00:00:00","23:59:00","00:00:00","23:59:00",true,false,true,false,false,false,false,"","","","",true,false,true,false,0]
["2023-05-17","Mi"," ",null,"08:00-16:00","08:00:00",null,null,"",0,"",null,null,"",null,null,"2023-05-17",true,"","A","A",0,-0.33333333333333298,0,false,false,true,{"$f":"IF(ISNA(VLOOKUP($B24,GAZ,AB$7,FALSE)),\"\",VLOOKUP($B24,GAZ,AB$7,FALSE))","v":"07:00:00"},"08:00:00","09:00:00","14:00:00","16:00:00","18:00:00",false,true,false,true,false,false,false,"00:00:00","23:59:00","00:00:00","23:59:00",true,false,true,false,false,false,false,"","","","",true,false,true,false,0]
["2023-05-18","Do"," Christi Himmelfahrt",null,"","00:00:00",null,null,"",0,"",null,null,"",null,null,"2023-05-18",true,"","F","F",0,0,0,true,false,false,"07:00:00","08:00:00","09:00:00","14:00:00","16:00:00","18:00:00",false,false,false,true,false,false,false,"00:00:00","23:59:00","00:00:00","23:59:00",true,false,true,false,false,false,false,"","","","",true,false,true,false,0]
["2023-05-19","Fr"," ",null,"08:00-16:00","08:00:00",null,null,"",0,"",null,null,"",null,null,"2023-05-19",true,"","A","A",0,-0.33333333333333298,0,false,false,true,"07:00:00","08:00:00","09:00:00","12:00:00","16:00:00","18:00:00",false,true,false,true,false,false,false,"00:00:00","23:59:00","00:00:00","23:59:00",true,false,true,false,false,false,false,"","","","",true,false,true,false,0]
["2023-05-20","Sa"," Wochenende",null,"","00:00:00",null,null,"",0,"",null,null,"",null,null,"2023-05-20",true,"","F","A",0,0,0,true,false,false,"","","","","","",false,false,false,true,true,false,false,"00:00:00","23:59:00","00:00:00","23:59:00",true,false,true,false,false,false,false,"00:00:00","23:59:00","00:00:00","23:59:00",true,false,true,false,0]
["2023-05-21","So"," Wochenende",null,"","00:00:00",null,null,"",0,"",null,null,"",null,null,"2023-05-21",true,"","F","F",0,0,0,true,false,false,"","","","","","",false,false,false,true,false,false,false,"00:00:00","23:59:00","00:00:00","23:59:00",true,false,true,false,false,false,false,"","","","",true,false,true,false,0]
["2023-05-22","Mo"," ",null,"08:00-16:00","08:00:00",null,null,"",0,"",null,null,"",null,null,"2023-05-22",true,"","A","A",0,-0.33333333333333298,0,false,false,true,"07:00:00","08:00:00","09:00:00","14:00:00","16:00:00","18:00:00",false,true,false,true,false,false,false,"00:00:00","23:59:00","00:00:00","23:59:00",true,false,true,false,false,false,false,"","","","",true,false,true,false,0]
["2023-05-23","Di"," ",null,"08:00-16:00","08:00:00",null,null,"",0,"",null,null,"",null,null,"2023-05-23",true,"","A","A",0,-0.33333333333333298,0,false,false,true,"07:00:00","08:00:00","09:00:00","14:00:00","16:00:00","18:00:00",false,true,false,true,false,false,false,"00:00:00","23:59:00","00:00:00","23:59:00",true,false,true,false,false,false,false,"","","","",true,false,true,false,0]
["2023-05-24","Mi"," ",null,"08:00-16:00","08:00:00",null,null,"",0,"",null,null,"",null,null,"2023-05-24",true,"","A","A",0,-0.33333333333333298,0,false,false,true,"07:00:00","08:00:00","09:00:00","14:00:00","16:00:00","18:00:00",false,true,false,true,false,false,false,"00:00:00","23:59:00","00:00:00","23:59:00",true,false,true,false,false,false,false,"","","","",true,false,true,false,0]
["2023-05-25","Do"," ",null,"08:00-16:00","08:00:00",null,null,"",0,"",null,null,"",null,null,"2023-05-25",true,"","A","A",0,-0.33333333333333298,0,false,false,true,"07:00:00","08:00:00","09:00:00","14:00:00","16:00:00","18:00:00",false,true,false,true,false,false,false,"00:00:00","23:59:00","00:00:00","23:59:00",true,false,true,false,false,false,false,"","","","",true,false,true,false,0]
["2023-05-26","Fr"," ",null,"08:00-16:00","08:00:00",null,null,"",0,"",null,null,"",null,null,"2023-05-26",true,"","A","A",0,-0.33333333333333298,0,false,false,true,"07:00:00","08:00:00","09:00:00","12:00:00","16:00:00","18:00:00",false,true,false,true,false,false,false,"00:00:00","23:59:00","00:00:00","23:59:00",true,false,true,false,false,false,false,"","","","",true,false,true,false,0]
["2023-05-27","Sa"," Wochenende",null,"","00:00:00",null,null,"",0,"",null,null,"",null,null,"2023-05-27",true,"","F","A",0,0,0,true,false,false,"","","","","","",false,false,false,true,true,false,false,"00:00:00","23:59:00","00:00:00","23:59:00",true,false,true,false,false,false,false,"00:00:00","23:59:00","00:00:00","23:59:00",true,false,true,false,0]
["2023-05-28","So"," Pfingsten",null,"","00:00:00",null,null,"",0,"",null,null,"",null,null,"2023-05-28",true,"","F","F",0,0,0,true,false,false,"","","","","","",false,false,false,true,false,false,false,"00:00:00","23:59:00","00:00:00","23:59:00",true,false,true,false,false,false,false,"","","","",true,false,true,false,0]
["2023-05-29","Mo"," Pfingstmontag",null,"","00:00:00",null,null,"",0,"",null,null,"",null,null,"2023-05-29",true,"","F","F",0,0,0,true,false,false,"07:00:00","08:00:00","09:00:00","14:00:00","16:00:00","18:00:00",false,false,false,true,false,false,false,"00:00:00","23:59:00","00:00:00","23:59:00",true,false,true,false,false,false,false,"","","","",true,false,true,false,0]
["2023-05-30","Di"," ",null,"08:00-16:00","08:00:00",null,null,"",0,"",null,null,"",null,null,"2023-05-30",true,"","A","A",0,-0.33333333333333298,0,false,false,true,"07:00:00","08:00:00","09:00:00","14:00:00","16:00:00","18:00:00",false,true,false,true,false,false,false,"00:00:00","23:59:00","00:00:00","23:59:00",true,false,true,false,false,false,false,"","","","",true,false,true,false,0]
["2023-05-31","Mi"," ",null,"08:00-16:00","08:00:00",null,null,"",{"$f":"IF($R38,$X38,\"\")","v":0},"",null,null,"",null,null,"2023-05-31",true,"","A","A",0,-0.33333333333333298,0,false,false,true,"07:00:00","08:00:00","09:00:00","14:00:00","16:00:00","18:00:00",false,true,false,true,false,false,false,"00:00:00","23:59:00","00:00:00","23:59:00",true,false,true,false,false,false,false,"","","","",true,false,true,false,0]
["Arbeitstage",{"$f":"COUNTIF(T$8:T$38,\"A\")","v":20},null,null,{"$f":"\"Saldo Monat (~15min) > \"","v":"Saldo Monat (~15min) > "},null,null,null,{"$f":"ROUND(SUM(I8:I38)*4,0)/4","v":0},null,{"$f":"SUM(K8:K38)","v":0}," < ÜS1:2",null,{"$f":"SUM(N8:N38)","v":0},{"$f":"IF(Zeitmodell=\"Vollzeit\",\" < ÜS1:1,5 \",\" < ÜS1:1,25 \")&Zeitmodell","v":" < ÜS1:1,5 Vollzeit"},null,"Zeitmodell Text"]
["Freie Tage",{"$f":"COUNTIF(T$8:T$38,\"F\")","v":11},null,null,{"$f":"\"Saldo \"&IF(Zeitmodell=\"Vollzeit\",\"1:1,5\",\"1:1,25\")& \" (~15min) > \"","v":"Saldo 1:1,5 (~15min) > "},null,null,null,{"$f":"ROUND($N40*4,0)/4","v":0},null,null,null,null,{"$f":"IF(Zeitmodell=\"Vollzeit\",$N39*1.5,$N39*1.25)","v":0},{"$f":"IF(Zeitmodell=\"Vollzeit\",\" < 1:1,5 \",\" < 1:1,25 \")&$Q40","v":" < 1:1,5 Stunden berechnen"},null,"Stunden berechnen"]
["ZK-Tage",0,null,null,"Saldo 1:2 (~15min) > ",null,null,null,{"$f":"ROUND($N41*4,0)/4","v":0},null,null,null,null,{"$f":"K39*2","v":0}," < 1:2    Stunden berechnen"]
["ZA-Tage",{"$f":"COUNTIF(D$8:D$38,\"Z\")","v":0},null,null," Saldo Vormonat > ",null,null,null,{"$f":"$J5","v":0},null,null,null,null,null,null,null,"Gültigkeit ausbezahlt"]
["Urlaubstage",{"$f":"COUNTIF(D$8:D$38,\"U\")","v":0},null,null," Saldo Gesamt > ",null,null,null,{"$f":"SUM(I39:I42)","v":0},null,{"$f":"IF($I$43>=$R$2,\"< Hier ausbezahlte Std. eingeben. (Die Eingabe ist hier erst ab   < einem Saldo von \"&TEXT($R$2,\"#.##0,00\")&\" Std., und nur in 0,25-Schritten möglich.)\",\"\")","v":""},null,null,null,null,null,{"$f":"IF(AND($J$43<>\"\",NOT(ISNUMBER($J$43))),FALSE,OR(AND($J$43>=0,$J$43<=$I$43,MOD($J$43,0.25)=0),$J$43=\"\"))","v":true}]
["Krank",{"$f":"COUNTIF(D$8:D$38,\"K\")","v":0},null,null," Saldo Übertrag > ",null,null,null,{"$f":"$I43-$J43","v":0},{"$f":"\" < Dieser Stunden-Saldo wird in das nächste \"&IF($Q$3=\"Dezember\",\"Jahr\",\"Monat\")&\" übertragen\"","v":" < Dieser Stunden-Saldo wird in das nächste Monat übertragen"}]
[null,null,null,"Z"]
[]
[]
[{"$f":"\"Unterschrift von \"&Vorgesetzter","v":"Unterschrift von Vorname Nachname"},null,null,null,null,null,null,null,null,null,null,{"$f":"\"Unterschrift von \"&Name","v":"Unterschrift von Vorname Nachname"}]

{"sheet":"Juni","index":6,"n_rows":48,"n_cols":60,"rows_kept":48,"cut":false,"hidden":true,"merged":[[47,0,47,3],[47,11,47,15],[42,4,42,7],[42,10,42,15],[43,4,43,7],[44,4,44,7],[45,4,45,7],[46,4,46,7],[38,2,43,3],[38,4,38,7],[38,11,38,12],[38,14,38,15],[39,4,39,7],[39,14,39,15],[40,4,40,7],[40,14,40,15],[41,4,41,7],[41,10,41,15],[5,7,6,7],[5,10,6,10],[5,11,6,11],[5,12,6,12],[5,13,6,13],[5,27,5,32],[4,2,4,3],[4,4,4,5],[5,2,6,2],[5,3,6,3],[5,5,6,5],[5,6,6,6],[0,15,1,15],[1,5,1,7],[2,5,2,7],[3,0,3,3],[3,4,3,5],[3,6,4,8],[3,14,6,14],[3,15,6,15],[4,0,6,0],[4,1,6,1]]}
[" BOKU-Zeiterfassung für Allgemeines Personal",null,null,null,null,null,null,null,null,null,null,null,null,null,null,null,"Monat","Stunden-Saldo Grenzen","Status Blatteingabe"]
[{"$f":"\" Org.-Einh. : \"&OrgEinheit","v":" Org.-Einh. : HXXXXX"},null,null,null,null,"Zeitmodell:",null,null,{"$f":"\" \"&Zeitmodell","v":" Vollzeit"},"Modus:",{"$f":"\" \"&Zeitmodus","v":" Gleitzeit"},null,null,null,null,null,{"$f":"IF(ISNA($Q$4),1,$Q$4)","v":6},{"$f":"IF($Q$2=12,NormalOGDez,NormalOG)","v":71.999999999999986},{"$f":"SUM($BH8:$BH38)","v":0}]
[{"$f":" \" Mitarbeiter/in: \"&Name","v":" Mitarbeiter/in: Vorname Nachname"},null,null,null,null,"Vorgesetzte/r:",null,null,{"$f":"\" \"&Vorgesetzter","v":" Vorname Nachname"},null,null,null,null,null,null,null,{"$f":"RIGHT(CELL(\"filename\",A1),LEN(CELL(\"filename\",A1))-SEARCH(\"]\",CELL(\"filename\",A1),1))","v":"Juni"},{"$f":"IF($Q$2=12,NormalUGDez,NormalUG)","v":-24},{"$f":"IF($Q$2=1,$S$2,$S$2+INDIRECT($S$5))","v":0}]
[{"$f":" \" Monat: \"&$Q$3&\" \"&Jahr","v":" Monat: Juni 2023"},null,null,null,"Dienstplan",null,"Normalstunden Feiertag-ÜS1:2",null,null,"Übertrag","Überstundenberechnung",null,null,null," Unterschrift des\n Vorgesetzten","Anmerkungen \n(z.B. Überstunden- notwendigkeit)",{"$f":"IF(ISNA(VLOOKUP($Q$3,MTab,2,FALSE)),1,VLOOKUP($Q$3,MTab,2,FALSE))","v":6},null,"Übertrags Adresse Blatteingabe"]
[" Datum","Wochentag","Tagesinformationen",null,{"$f":"\"Wochen-AZ\"&\" \"&TEXT(WAZ,\"[hh]:mm\")","v":"Wochen-AZ 40:00"},null,null,null,null,{"$f":"IF(ISNA($Q$5),Übertrag,INDIRECT($Q$5))","v":0},"ÜS1:2",{"$f":"IF(Zeitmodell=\"Vollzeit\",\" Überstunden1:1,5\",\" Überstunden1:1,25\")","v":" Überstunden1:1,5"},null,null,null,null,{"$f":"IF(ISNA(VLOOKUP($Q$3,MTab,3,FALSE)),\"Übertrag\",VLOOKUP($Q$3,MTab,3,FALSE))","v":"Mai!$I$44"},null,{"$f":"IF(ISNA(VLOOKUP($Q$3,MTab,4,FALSE)),$Q$3&\"!$S$2\",VLOOKUP($Q$3,MTab,4,FALSE))","v":"Mai!$S$3"}]
[null,null," Feiertage\n Wochenende\n Urlaub, ZA, Krank","[U]rlaub\n[Z]A\n[ZK]\n[K]rank","Normal-","Soll","Von","Bis","Plus","Saldo","Plus","Von","Bis","Plus",null,null,"Hintergrundberechnungen",null,null,null,null,null,null,"Saldo aktuell",null,null,null,"GAZ-Tabellenabbildung",null,null,null,null,null,"Eingabebeprüfungen"]
[null,null,null,null,"Arbeitszeit",null,null,null,"Minus","akuell",null,null,null,null,null,null,"Datum","Monat OK","Abwesenh.","Freie Tage","ÜA-Tage","Std.","Soll-Std.",{"$f":"IF(ISNA($Q$5),Übertrag,INDIRECT($Q$5))","v":0},"Std.-Soll = 0","Std.-Soll > 0","Std.-Soll < 0",{"$f":"I_GAZGRVon","v":2},{"$f":"I_GAZNAZVon","v":3},{"$f":"I_GAZKVon","v":4},{"$f":"I_GAZKBis","v":6},{"$f":"I_GAZNAZBis","v":7},{"$f":"I_GAZGRBis","v":8},"Zeiteingabe","UZK-Eing.\nerlaubt","UZK-Eing.\ngültig","Normalst. ein erlaubt","Überstd. ein erlaubt","Normalstd.\neingegeben","Überstd.\neingegeben","Normal VON möglich OG","Normal VON möglich UG","Normal BIS möglich OG","Normal BIS möglich UG","Normal VON\n15min","Normal VON richtig","Normal BIS\n15min","Normal BIS richtig","ZA-Kern Von","ZA-Kern Bis","ZA-Kern","Über VON Obergrenze","Über VON Untergrenze","Über BIS Obergrenze","Über BIS Untergrenze","Über VON\n15min","Über VON richtig","Überl BIS\n15min","Über BIS richtig","Status Zeilen Eingabe"]
[{"$f":"IF($R8,$Q8,\"\")","v":"2023-06-01"},{"$f":"IF($R8,VLOOKUP(WEEKDAY($Q8,2),WOTA,2,FALSE),\"\")","v":"Do"},{"$f":"IF($R8,\" \"&IF($S8=\"\",VLOOKUP($Q8,FListe,3,FALSE),$S8),\"\")","v":" "},null,{"$f":"IF(AND($R8,$T8<>\"F\"),IF($AC8=$AF8,\"keine NAZ\",TEXT($AC8,\"hh:mm\")&\"-\"&TEXT($AF8,\"hh:mm\")),\"\")","v":"08:00-16:00"},{"$f":"IF($R8,IF($T8=\"F\",0,VLOOKUP($B8,GAZ,I_GAZNAZ,FALSE)),\"\")","v":"08:00:00"},null,null,{"$f":"IF(Zeitmodus=\"Gleitzeit\",IF($U8=\"F\",\"\",IF(AND($R8,$AM8,NOT($Y8)),ROUND(($V8-$F8)*24,2),IF($D8=\"Z\",$F8*-24,\"\"))),IF(OR($D8=\"Z\",AND($AM8,$U8=\"A\",W8<0)),ROUND($W8*24,2),\"\"))","v":""},{"$f":"IF($R8,$X8,\"\")","v":0},{"$f":"IF(AND($U8=\"F\",$AM8),ROUND($V8*24,2),\"\")","v":""},null,null,{"$f":"IF(Zeitmodus=\"Gleitzeit\",IF(AND($R8,$AN8,$M8-$L8<>0,$AL8),ROUND(($M8-$L8)*24,2),\"\"),IF(AND($AM8,$U8=\"A\",W8>0),ROUND(W8*24,2),\"\"))","v":""},null,null,{"$f":"DATE(Jahr,$Q2,1)","v":"2023-06-01"},{"$f":"$Q$2=MONTH($Q8)","v":true},{"$f":"IF(OR($D8=\"U\",$D8=\"Z\",$D8=\"ZK\",$D8=\"K\"),VLOOKUP($D8,UZK,2,FALSE),\"\")","v":""},{"$f":"IF($R8,VLOOKUP($Q8,FListe,4,FALSE),\"\")","v":"A"},{"$f":"IF($R8,VLOOKUP($Q8,FListe,5,FALSE),\"\")","v":"A"},{"$f":"$H8-$G8","v":0},{"$f":"IF($R8,ROUND($V8-$F8,15),\"\")","v":-0.33333333333333298},{"$f":"IF($I8<>\"\",$X7+$I8,$X7)","v":0},{"$f":"($W8=0)","v":false},{"$f":"($W8>0)","v":false},{"$f":"($W8<0)","v":true},{"$f":"IF(ISNA(VLOOKUP($B8,GAZ,AB$7,FALSE)),\"\",VLOOKUP($B8,GAZ,AB$7,FALSE))","v":"07:00:00"},"08:00:00",{"$f":"IF(ISNA(VLOOKUP($B8,GAZ,AD$7,FALSE)),\"\",IF($AC8=$AF8,$G8,VLOOKUP($B8,GAZ,AD$7,FALSE)))","v":"09:00:00"},{"$f":"IF(ISNA(VLOOKUP($B8,GAZ,AE$7,FALSE)),\"\",IF($AC8=$AF8,$H8,VLOOKUP($B8,GAZ,AE$7,FALSE)))","v":"14:00:00"},"16:00:00","18:00:00",{"$f":"OR($G8<>\"\",$H8<>\"\",$L8<>\"\",$M8<>\"\")","v":false},{"$f":"AND($T8<>\"F\",NOT($AH8),NOT($AC8=$AF8))","v":true},{"$f":"AND($AI8,OR($D8=\"U\",$D8=\"Z\",$D8=\"K\"))","v":false},{"$f":"AND($D8<>\"U\",$D8<>\"Z\",$D8<>\"K\",$R8)","v":true},{"$f":"AND(Zeitmodus=C_Gleitzeit,$U8<>\"F\",OR($B8=\"Sa\",AND($AM8,$I8>=0,NOT($AY8))))","v":false},{"$f":"AND($G8<>\"\",$H8<>\"\")","v":false},{"$f":"OR($K8<>\"\",AND($L8<>\"\",$M8<>\"\"))","v":false},{"$f":"IF($AK8,TagUG,\"\")","v":"00:00:00"},{"$f":"IF($AK8,IF($H8=\"\",IF(AND($L8<>\"\",$L8<$AG8),$L8,IF(AND($M8<>\"\",$M8<$AG8),$M8,TagOG)),$H8),\"\")","v":"23:59:00"},{"$f":"IF($AK8,IF($G8=\"\",$AB8,$G8),\"\")","v":"07:00:00"},{"$f":"IF($AK8,IF(AND($L8<>\"\",$L8<$AG8),$L8,IF(AND($M8<>\"\",$M8<$AG8),$M8,TagOG)),\"\")","v":"23:59:00"},{"$f":"MOD($G8*24,0.25)=0","v":true},{"$f":"AND($AK8,ISNUMBER($G8),$G8>=$AO8,$G8<=$AP8)","v":false},{"$f":"MOD($H8*24,0.25)=0","v":true},{"$f":"AND($AK8,ISNUMBER($H8),$H8>=$AQ8,$H8<=$AR8)","v":false},{"$f":"AND(Zeitmodus=C_Gleitzeit,$B8<>\"Sa\",$G8<>\"\",$G8>$AD8)","v":false},{"$f":"AND(Zeitmodus=C_Gleitzeit,$B8<>\"Sa\",$H8<>\"\",$H8<$AE8)","v":false},{"$f":"AND($U8<>\"F\",OR($AW8,$AX8))","v":false},{"$f":"IF($B8=\"Sa\",IF($H8<>\"\",$H8,TIME(0,0,0)),IF($AL8,IF(AND($H8<>\"\",$H8>$AF8),$H8,$AF8),\"\"))","v":""},{"$f":"IF($AL8,IF($M8<>\"\",$M8,$BC8),\"\")","v":""},{"$f":"IF($B8=\"Sa\",IF($L8=\"\",TIME(0,0,0),$L8),IF($AL8,IF($L8<>\"\",$L8,IF(AND($H8<>\"\",$H8>$AF8),$H8,$AF8)),\"\"))","v":""},{"$f":"IF($AL8,TIME(23,59,0),\"\")","v":""},{"$f":"MOD($L8*24,0.25)=0","v":true},{"$f":"AND($AL8,ISNUMBER($L8),$L8>=$AZ8,$BA8>=$L8)","v":false},{"$f":"MOD($M8*24,0.25)=0","v":true},{"$f":"AND($AL8,ISNUMBER($M8),$M8>=$BB8,$M8<=$BC8)","v":false},{"$f":"IF(AND(ISBLANK($D8),ISBLANK($G8),ISBLANK($H8),ISBLANK($L8),ISBLANK($M8),ISBLANK($P8)),0,1)","v":0}]
[{"$f":"IF($R9,$Q9,\"\")","v":"2023-06-02"},"Fr"," ",null,{"$f":"IF(AND($R9,$T9<>\"F\"),IF($AC9=$AF9,\"keine NAZ\",TEXT($AC9,\"hh:mm\")&\"-\"&TEXT($AF9,\"hh:mm\")),\"\")","v":"08:00-16:00"},"08:00:00",null,null,"",0,{"$f":"IF(AND($U9=\"F\",$AM9),ROUND($V9*24,2),\"\")","v":""},null,null,"",null,null,{"$f":" Q8+1","v":"2023-06-02"},true,"","A","A",0,-0.33333333333333298,0,false,false,true,"07:00:00","08:00:00","09:00:00","12:00:00","16:00:00","18:00:00",false,{"$f":"AND($T9<>\"F\",NOT($AH9),NOT($AC9=$AF9))","v":true},false,true,{"$f":"AND(Zeitmodus=C_Gleitzeit,$U9<>\"F\",OR($B9=\"Sa\",AND($AM9,$I9>=0,NOT($AY9))))","v":false},false,{"$f":"OR($K9<>\"\",AND($L9<>\"\",$M9<>\"\"))","v":false},"00:00:00","23:59:00",{"$f":"IF($AK9,IF($G9=\"\",TagUG,$G9),\"\")","v":"00:00:00"},"23:59:00",true,false,true,false,false,false,{"$f":"AND($U9<>\"F\",OR($AW9,$AX9))","v":false},"","","","",true,false,true,false,0]
["2023-06-03","Sa"," Wochenende",null,"","00:00:00",null,null,"",0,"",null,null,"",null,null,"2023-06-03",true,"","F","A",0,0,0,true,false,false,"","","","","","",false,false,false,true,true,false,false,"00:00:00","23:59:00","00:00:00","23:59:00",true,false,true,false,false,false,false,"00:00:00","23:59:00","00:00:00","23:59:00",true,false,true,false,0]
["2023-06-04","So"," Wochenende",null,"","00:00:00",null,null,"",0,"",null,null,"",null,null,"2023-06-04",true,"","F","F",0,0,0,true,false,false,"","","","","","",false,false,false,true,false,false,false,"00:00:00","23:59:00","00:00:00","23:59:00",true,false,true,false,false,false,false,"","","","",true,false,true,false,0]
["2023-06-05","Mo"," ",null,"08:00-16:00","08:00:00",null,null,"",0,"",null,null,"",null,null,"2023-06-05",true,"","A","A",0,-0.33333333333333298,0,false,false,true,"07:00:00","08:00:00","09:00:00","14:00:00","16:00:00","18:00:00",false,true,false,true,false,false,false,"00:00:00","23:59:00","00:00:00","23:59:00",true,false,true,false,false,false,false,"","","","",true,false,true,false,0]
["2023-06-06","Di"," ",null,"08:00-16:00","08:00:00",null,null,"",0,"",null,null,"",null,null,"2023-06-06",true,"","A","A",0,-0.33333333333333298,0,false,false,true,"07:00:00","08:00:00","09:00:00","14:00:00","16:00:00","18:00:00",false,true,false,true,false,false,false,"00:00:00","23:59:00","00:00:00","23:59:00",true,false,true,false,false,false,false,"","","","",true,false,true,false,0]
["2023-06-07","Mi"," ",null,"08:00-16:00","08:00:00",null,null,"",0,"",null,null,"",null,null,"2023-06-07",true,"","A","A",0,-0.33333333333333298,0,false,false,true,"07:00:00","08:00:00","09:00:00","14:00:00","16:00:00","18:00:00",false,true,false,true,false,false,false,"00:00:00","23:59:00","00:00:00","23:59:00",true,false,true,false,false,false,false,"","","","",true,false,true,false,0]
["2023-06-08","Do"," Fronleichnam",null,"","00:00:00",null,null,"",0,"",null,null,"",null,null,"2023-06-08",true,"","F","F",0,0,0,true,false,false,"07:00:00","08:00:00","09:00:00","14:00:00","16:00:00","18:00:00",false,false,false,true,false,false,false,"00:00:00","23:59:00","00:00:00","23:59:00",true,false,true,false,false,false,false,"","","","",true,false,true,false,0]
["2023-06-09","Fr"," ",null,"08:00-16:00","08:00:00",null,null,"",0,"",null,null,"",null,null,"2023-06-09",true,"","A","A",0,-0.33333333333333298,0,false,false,true,"07:00:00","08:00:00","09:00:00","12:00:00","16:00:00","18:00:00",false,true,false,true,false,false,false,"00:00:00","23:59:00","00:00:00","23:59:00",true,false,true,false,false,false,false,"","","","",true,false,true,false,0]
["2023-06-10","Sa"," Wochenende",null,"","00:00:00",null,null,"",0,"",null,null,"",null,null,"2023-06-10",true,"","F","A",0,0,0,true,false,false,"","","","","","",false,false,false,true,true,false,false,"00:00:00","23:59:00","00:00:00","23:59:00",true,false,true,false,false,false,false,"00:00:00","23:59:00","00:00:00","23:59:00",true,false,true,false,0]
["2023-06-11","So"," Vatertag",null,"","00:00:00",null,null,"",0,"",null,null,"",null,null,"2023-06-11",true,"","F","F",0,0,0,true,false,false,"","","","","","",false,false,false,true,false,false,false,"00:00:00","23:59:00","00:00:00","23:59:00",true,false,true,false,false,false,false,"","","","",true,false,true,false,0]
["2023-06-12","Mo"," ",null,"08:00-16:00","08:00:00",null,null,"",0,"",null,null,"",null,null,"2023-06-12",true,"","A","A",0,-0.33333333333333298,0,false,false,true,"07:00:00","08:00:00","09:00:00","14:00:00","16:00:00","18:00:00",false,true,false,true,false,false,false,"00:00:00","23:59:00","00:00:00","23:59:00",true,false,true,false,false,false,false,"","","","",true,false,true,false,0]
["2023-06-13","Di"," ",null,"08:00-16:00","08:00:00",null,null,"",0,"",null,null,"",null,null,"2023-06-13",true,"","A","A",0,-0.33333333333333298,0,false,false,true,"07:00:00","08:00:00","09:00:00","14:00:00","16:00:00","18:00:00",false,true,false,true,false,false,false,"00:00:00","23:59:00","00:00:00","23:59:00",true,false,true,false,false,false,false,"","","","",true,false,true,false,0]
["2023-06-14","Mi"," ",null,"08:00-16:00","08:00:00",null,null,"",0,"",null,null,"",null,null,"2023-06-14",true,"","A","A",0,-0.33333333333333298,0,false,false,true,"07:00:00","08:00:00","09:00:00","14:00:00","16:00:00","18:00:00",false,true,false,true,false,false,false,"00:00:00","23:59:00","00:00:00","23:59:00",true,false,true,false,false,false,false,"","","","",true,false,true,false,0]
["2023-06-15","Do"," ",null,"08:00-16:00","08:00:00",null,null,"",0,"",null,null,"",null,null,"2023-06-15",true,"","A","A",0,-0.33333333333333298,0,false,false,true,"07:00:00","08:00:00","09:00:00","14:00:00","16:00:00","18:00:00",false,true,false,true,false,false,false,"00:00:00","23:59:00","00:00:00","23:59:00",true,false,true,false,false,false,false,"","","","",true,false,true,false,0]
["2023-06-16","Fr"," ",null,"08:00-16:00","08:00:00",null,null,"",0,"",null,null,"",null,null,"2023-06-16",true,"","A","A",0,-0.33333333333333298,0,false,false,true,"07:00:00","08:00:00","09:00:00","12:00:00","16:00:00","18:00:00",false,true,false,true,false,false,false,"00:00:00","23:59:00","00:00:00","23:59:00",true,false,true,false,false,false,false,"","","","",true,false,true,false,0]
["2023-06-17","Sa"," Wochenende",null,"","00:00:00",null,null,"",0,"",null,null,"",null,null,"2023-06-17",true,"","F","A",0,0,0,true,false,false,{"$f":"IF(ISNA(VLOOKUP($B24,GAZ,AB$7,FALSE)),\"\",VLOOKUP($B24,GAZ,AB$7,FALSE))","v":""},"","","","","",false,false,false,true,true,false,false,"00:00:00","23:59:00","00:00:00","23:59:00",true,false,true,false,false,false,false,"00:00:00","23:59:00","00:00:00","23:59:00",true,false,true,false,0]
["2023-06-18","So"," Wochenende",null,"","00:00:00",null,null,"",0,"",null,null,"",null,null,"2023-06-18",true,"","F","F",0,0,0,true,false,false,"","","","","","",false,false,false,true,false,false,false,"00:00:00","23:59:00","00:00:00","23:59:00",true,false,true,false,false,false,false,"","","","",true,false,true,false,0]
["2023-06-19","Mo"," ",null,"08:00-16:00","08:00:00",null,null,"",0,"",null,null,"",null,null,"2023-06-19",true,"","A","A",0,-0.33333333333333298,0,false,false,true,"07:00:00","08:00:00","09:00:00","14:00:00","16:00:00","18:00:00",false,true,false,true,false,false,false,"00:00:00","23:59:00","00:00:00","23:59:00",true,false,true,false,false,false,false,"","","","",true,false,true,false,0]
["2023-06-20","Di"," ",null,"08:00-16:00","08:00:00",null,null,"",0,"",null,null,"",null,null,"2023-06-20",true,"","A","A",0,-0.33333333333333298,0,false,false,true,"07:00:00","08:00:00","09:00:00","14:00:00","16:00:00","18:00:00",false,true,false,true,false,false,false,"00:00:00","23:59:00","00:00:00","23:59:00",true,false,true,false,false,false,false,"","","","",true,false,true,false,0]
["2023-06-21","Mi"," ",null,"08:00-16:00","08:00:00",null,null,"",0,"",null,null,"",null,null,"2023-06-21",true,"","A","A",0,-0.33333333333333298,0,false,false,true,"07:00:00","08:00:00","09:00:00","14:00:00","16:00:00","18:00:00",false,true,false,true,false,false,false,"00:00:00","23:59:00","00:00:00","23:59:00",true,false,true,false,false,false,false,"","","","",true,false,true,false,0]
["2023-06-22","Do"," ",null,"08:00-16:00","08:00:00",null,null,"",0,"",null,null,"",null,null,"2023-06-22",true,"","A","A",0,-0.33333333333333298,0,false,false,true,"07:00:00","08:00:00","09:00:00","14:00:00","16:00:00","18:00:00",false,true,false,true,false,false,false,"00:00:00","23:59:00","00:00:00","23:59:00",true,false,true,false,false,false,false,"","","","",true,false,true,false,0]
["2023-06-23","Fr"," ",null,"08:00-16:00","08:00:00",null,null,"",0,"",null,null,"",null,null,"2023-06-23",true,"","A","A",0,-0.33333333333333298,0,false,false,true,"07:00:00","08:00:00","09:00:00","12:00:00","16:00:00","18:00:00",false,true,false,true,false,false,false,"00:00:00","23:59:00","00:00:00","23:59:00",true,false,true,false,false,false,false,"","","","",true,false,true,false,0]
["2023-06-24","Sa"," Wochenende",null,"","00:00:00",null,null,"",0,"",null,null,"",null,null,"2023-06-24",true,"","F","A",0,0,0,true,false,false,"","","","","","",false,false,false,true,true,false,false,"00:00:00","23:59:00","00:00:00","23:59:00",true,false,true,false,false,false,false,"00:00:00","23:59:00","00:00:00","23:59:00",true,false,true,false,0]
["2023-06-25","So"," Wochenende",null,"","00:00:00",null,null,"",0,"",null,null,"",null,null,"2023-06-25",true,"","F","F",0,0,0,true,false,false,"","","","","","",false,false,false,true,false,false,false,"00:00:00","23:59:00","00:00:00","23:59:00",true,false,true,false,false,false,false,"","","","",true,false,true,false,0]
["2023-06-26","Mo"," ",null,"08:00-16:00","08:00:00",null,null,"",0,"",null,null,"",null,null,"2023-06-26",true,"","A","A",0,-0.33333333333333298,0,false,false,true,"07:00:00","08:00:00","09:00:00","14:00:00","16:00:00","18:00:00",false,true,false,true,false,false,false,"00:00:00","23:59:00","00:00:00","23:59:00",true,false,true,false,false,false,false,"","","","",true,false,true,false,0]
["2023-06-27","Di"," ",null,"08:00-16:00","08:00:00",null,null,"",0,"",null,null,"",null,null,"2023-06-27",true,"","A","A",0,-0.33333333333333298,0,false,false,true,"07:00:00","08:00:00","09:00:00","14:00:00","16:00:00","18:00:00",false,true,false,true,false,false,false,"00:00:00","23:59:00","00:00:00","23:59:00",true,false,true,false,false,false,false,"","","","",true,false,true,false,0]
["2023-06-28","Mi"," ",null,"08:00-16:00","08:00:00",null,null,"",0,"",null,null,"",null,null,"2023-06-28",true,"","A","A",0,-0.33333333333333298,0,false,false,true,"07:00:00","08:00:00","09:00:00","14:00:00","16:00:00","18:00:00",false,true,false,true,false,false,false,"00:00:00","23:59:00","00:00:00","23:59:00",true,false,true,false,false,false,false,"","","","",true,false,true,false,0]
["2023-06-29","Do"," ",null,"08:00-16:00","08:00:00",null,null,"",0,"",null,null,"",null,null,"2023-06-29",true,"","A","A",0,-0.33333333333333298,0,false,false,true,"07:00:00","08:00:00","09:00:00","14:00:00","16:00:00","18:00:00",false,true,false,true,false,false,false,"00:00:00","23:59:00","00:00:00","23:59:00",true,false,true,false,false,false,false,"","","","",true,false,true,false,0]
["2023-06-30","Fr"," ",null,"08:00-16:00","08:00:00",null,null,"",0,"",null,null,"",null,null,"2023-06-30",true,"","A","A",0,-0.33333333333333298,0,false,false,true,"07:00:00","08:00:00","09:00:00","12:00:00","16:00:00","18:00:00",false,true,false,true,false,false,false,"00:00:00","23:59:00","00:00:00","23:59:00",true,false,true,false,false,false,false,"","","","",true,false,true,false,0]
["","","",null,"","",null,null,"",{"$f":"IF($R38,$X38,\"\")","v":""},"",null,null,"",null,null,"2023-07-01",false,"","","",0,"",0,false,true,false,"","","","","","",false,false,false,false,false,false,false,"","","","",true,false,true,false,false,false,false,"","","","",true,false,true,false,0]
["Arbeitstage",{"$f":"COUNTIF(T$8:T$38,\"A\")","v":21},null,null,{"$f":"\"Saldo Monat (~15min) > \"","v":"Saldo Monat (~15min) > "},null,null,null,{"$f":"ROUND(SUM(I8:I38)*4,0)/4","v":0},null,{"$f":"SUM(K8:K38)","v":0}," < ÜS1:2",null,{"$f":"SUM(N8:N38)","v":0},{"$f":"IF(Zeitmodell=\"Vollzeit\",\" < ÜS1:1,5 \",\" < ÜS1:1,25 \")&Zeitmodell","v":" < ÜS1:1,5 Vollzeit"},null,"Zeitmodell Text"]
["Freie Tage",{"$f":"COUNTIF(T$8:T$38,\"F\")","v":9},null,null,{"$f":"\"Saldo \"&IF(Zeitmodell=\"Vollzeit\",\"1:1,5\",\"1:1,25\")& \" (~15min) > \"","v":"Saldo 1:1,5 (~15min) > "},null,null,null,{"$f":"ROUND($N40*4,0)/4","v":0},null,null,null,null,{"$f":"IF(Zeitmodell=\"Vollzeit\",$N39*1.5,$N39*1.25)","v":0},{"$f":"IF(Zeitmodell=\"Vollzeit\",\" < 1:1,5 \",\" < 1:1,25 \")&$Q40","v":" < 1:1,5 Stunden berechnen"},null,"Stunden berechnen"]
["ZK-Tage",0,null,null,"Saldo 1:2 (~15min) > ",null,null,null,{"$f":"ROUND($N41*4,0)/4","v":0},null,null,null,null,{"$f":"K39*2","v":0}," < 1:2    Stunden berechnen"]
["ZA-Tage",{"$f":"COUNTIF(D$8:D$38,\"Z\")","v":0},null,null," Saldo Vormonat > ",null,null,null,{"$f":"$J5","v":0},null,null,null,null,null,null,null,"Gültigkeit ausbezahlt"]
["Urlaubstage",{"$f":"COUNTIF(D$8:D$38,\"U\")","v":0},null,null," Saldo Gesamt > ",null,null,null,{"$f":"SUM(I39:I42)","v":0},null,{"$f":"IF($I$43>=$R$2,\"< Hier ausbezahlte Std. eingeben. (Die Eingabe ist hier erst ab   < einem Saldo von \"&TEXT($R$2,\"#.##0,00\")&\" Std., und nur in 0,25-Schritten möglich.)\",\"\")","v":""},null,null,null,null,null,{"$f":"IF(AND($J$43<>\"\",NOT(ISNUMBER($J$43))),FALSE,OR(AND($J$43>=0,$J$43<=$I$43,MOD($J$43,0.25)=0),$J$43=\"\"))","v":true}]
["Krank",{"$f":"COUNTIF(D$8:D$38,\"K\")","v":0},null,null," Saldo Übertrag > ",null,null,null,{"$f":"$I43-$J43","v":0},{"$f":"\" < Dieser Stunden-Saldo wird in das nächste \"&IF($Q$3=\"Dezember\",\"Jahr\",\"Monat\")&\" übertragen\"","v":" < Dieser Stunden-Saldo wird in das nächste Monat übertragen"}]
[null,null,null,"Z"]
[]
[]
[{"$f":"\"Unterschrift von \"&Vorgesetzter","v":"Unterschrift von Vorname Nachname"},null,null,null,null,null,null,null,null,null,null,{"$f":"\"Unterschrift von \"&Name","v":"Unterschrift von Vorname Nachname"}]

{"sheet":"Juli","index":7,"n_rows":48,"n_cols":60,"rows_kept":48,"cut":false,"hidden":true,"merged":[[47,0,47,3],[47,11,47,15],[42,4,42,7],[42,10,42,15],[43,4,43,7],[44,4,44,7],[45,4,45,7],[46,4,46,7],[38,2,43,3],[38,4,38,7],[38,11,38,12],[38,14,38,15],[39,4,39,7],[39,14,39,15],[40,4,40,7],[40,14,40,15],[41,4,41,7],[41,10,41,15],[5,7,6,7],[5,10,6,10],[5,11,6,11],[5,12,6,12],[5,13,6,13],[5,27,5,32],[4,2,4,3],[4,4,4,5],[5,2,6,2],[5,3,6,3],[5,5,6,5],[5,6,6,6],[0,15,1,15],[1,5,1,7],[2,5,2,7],[3,0,3,3],[3,4,3,5],[3,6,4,8],[3,14,6,14],[3,15,6,15],[4,0,6,0],[4,1,6,1]]}
[" BOKU-Zeiterfassung für Allgemeines Personal",null,null,null,null,null,null,null,null,null,null,null,null,null,null,null,"Monat","Stunden-Saldo Grenzen","Status Blatteingabe"]
[{"$f":"\" Org.-Einh. : \"&OrgEinheit","v":" Org.-Einh. : HXXXXX"},null,null,null,null,"Zeitmodell:",null,null,{"$f":"\" \"&Zeitmodell","v":" Vollzeit"},"Modus:",{"$f":"\" \"&Zeitmodus","v":" Gleitzeit"},null,null,null,null,null,{"$f":"IF(ISNA($Q$4),1,$Q$4)","v":7},{"$f":"IF($Q$2=12,NormalOGDez,NormalOG)","v":71.999999999999986},{"$f":"SUM($BH8:$BH38)","v":0}]
[{"$f":" \" Mitarbeiter/in: \"&Name","v":" Mitarbeiter/in: Vorname Nachname"},null,null,null,null,"Vorgesetzte/r:",null,null,{"$f":"\" \"&Vorgesetzter","v":" Vorname Nachname"},null,null,null,null,null,null,null,{"$f":"RIGHT(CELL(\"filename\",A1),LEN(CELL(\"filename\",A1))-SEARCH(\"]\",CELL(\"filename\",A1),1))","v":"Juli"},{"$f":"IF($Q$2=12,NormalUGDez,NormalUG)","v":-24},{"$f":"IF($Q$2=1,$S$2,$S$2+INDIRECT($S$5))","v":0}]
[{"$f":" \" Monat: \"&$Q$3&\" \"&Jahr","v":" Monat: Juli 2023"},null,null,null,"Dienstplan",null,"Normalstunden Feiertag-ÜS1:2",null,null,"Übertrag","Überstundenberechnung",null,null,null," Unterschrift des\n Vorgesetzten","Anmerkungen \n(z.B. Überstunden- notwendigkeit)",{"$f":"IF(ISNA(VLOOKUP($Q$3,MTab,2,FALSE)),1,VLOOKUP($Q$3,MTab,2,FALSE))","v":7},null,"Übertrags Adresse Blatteingabe"]
[" Datum","Wochentag","Tagesinformationen",null,{"$f":"\"Wochen-AZ\"&\" \"&TEXT(WAZ,\"[hh]:mm\")","v":"Wochen-AZ 40:00"},null,null,null,null,{"$f":"IF(ISNA($Q$5),Übertrag,INDIRECT($Q$5))","v":0},"ÜS1:2",{"$f":"IF(Zeitmodell=\"Vollzeit\",\" Überstunden1:1,5\",\" Überstunden1:1,25\")","v":" Überstunden1:1,5"},null,null,null,null,{"$f":"IF(ISNA(VLOOKUP($Q$3,MTab,3,FALSE)),\"Übertrag\",VLOOKUP($Q$3,MTab,3,FALSE))","v":"Juni!$I$44"},null,{"$f":"IF(ISNA(VLOOKUP($Q$3,MTab,4,FALSE)),$Q$3&\"!$S$2\",VLOOKUP($Q$3,MTab,4,FALSE))","v":"Juni!$S$3"}]
[null,null," Feiertage\n Wochenende\n Urlaub, ZA, Krank","[U]rlaub\n[Z]A\n[ZK]\n[K]rank","Normal-","Soll","Von","Bis","Plus","Saldo","Plus","Von","Bis","Plus",null,null,"Hintergrundberechnungen",null,null,null,null,null,null,"Saldo aktuell",null,null,null,"GAZ-Tabellenabbildung",null,null,null,null,null,"Eingabebeprüfungen"]
[null,null,null,null,"Arbeitszeit",null,null,null,"Minus","akuell",null,null,null,null,null,null,"Datum","Monat OK","Abwesenh.","Freie Tage","ÜA-Tage","Std.","Soll-Std.",{"$f":"IF(ISNA($Q$5),Übertrag,INDIRECT($Q$5))","v":0},"Std.-Soll = 0","Std.-Soll > 0","Std.-Soll < 0",{"$f":"I_GAZGRVon","v":2},{"$f":"I_GAZNAZVon","v":3},{"$f":"I_GAZKVon","v":4},{"$f":"I_GAZKBis","v":6},{"$f":"I_GAZNAZBis","v":7},{"$f":"I_GAZGRBis","v":8},"Zeiteingabe","UZK-Eing.\nerlaubt","UZK-Eing.\ngültig","Normalst. ein erlaubt","Überstd. ein erlaubt","Normalstd.\neingegeben","Überstd.\neingegeben","Normal VON möglich OG","Normal VON möglich UG","Normal BIS möglich OG","Normal BIS möglich UG","Normal VON\n15min","Normal VON richtig","Normal BIS\n15min","Normal BIS richtig","ZA-Kern Von","ZA-Kern Bis","ZA-Kern","Über VON Obergrenze","Über VON Untergrenze","Über BIS Obergrenze","Über BIS Untergrenze","Über VON\n15min","Über VON richtig","Überl BIS\n15min","Über BIS richtig","Status Zeilen Eingabe"]
[{"$f":"IF($R8,$Q8,\"\")","v":"2023-07-01"},{"$f":"IF($R8,VLOOKUP(WEEKDAY($Q8,2),WOTA,2,FALSE),\"\")","v":"Sa"},{"$f":"IF($R8,\" \"&IF($S8=\"\",VLOOKUP($Q8,FListe,3,FALSE),$S8),\"\")","v":" Wochenende"},null,{"$f":"IF(AND($R8,$T8<>\"F\"),IF($AC8=$AF8,\"keine NAZ\",TEXT($AC8,\"hh:mm\")&\"-\"&TEXT($AF8,\"hh:mm\")),\"\")","v":""},{"$f":"IF($R8,IF($T8=\"F\",0,VLOOKUP($B8,GAZ,I_GAZNAZ,FALSE)),\"\")","v":"00:00:00"},null,null,{"$f":"IF(Zeitmodus=\"Gleitzeit\",IF($U8=\"F\",\"\",IF(AND($R8,$AM8,NOT($Y8)),ROUND(($V8-$F8)*24,2),IF($D8=\"Z\",$F8*-24,\"\"))),IF(OR($D8=\"Z\",AND($AM8,$U8=\"A\",W8<0)),ROUND($W8*24,2),\"\"))","v":""},{"$f":"IF($R8,$X8,\"\")","v":0},{"$f":"IF(AND($U8=\"F\",$AM8),ROUND($V8*24,2),\"\")","v":""},null,null,{"$f":"IF(Zeitmodus=\"Gleitzeit\",IF(AND($R8,$AN8,$M8-$L8<>0,$AL8),ROUND(($M8-$L8)*24,2),\"\"),IF(AND($AM8,$U8=\"A\",W8>0),ROUND(W8*24,2),\"\"))","v":""},null,null,{"$f":"DATE(Jahr,$Q2,1)","v":"2023-07-01"},{"$f":"$Q$2=MONTH($Q8)","v":true},{"$f":"IF(OR($D8=\"U\",$D8=\"Z\",$D8=\"ZK\",$D8=\"K\"),VLOOKUP($D8,UZK,2,FALSE),\"\")","v":""},{"$f":"IF($R8,VLOOKUP($Q8,FListe,4,FALSE),\"\")","v":"F"},{"$f":"IF($R8,VLOOKUP($Q8,FListe,5,FALSE),\"\")","v":"A"},{"$f":"$H8-$G8","v":0},{"$f":"IF($R8,ROUND($V8-$F8,15),\"\")","v":0},{"$f":"IF($I8<>\"\",$X7+$I8,$X7)","v":0},{"$f":"($W8=0)","v":true},{"$f":"($W8>0)","v":false},{"$f":"($W8<0)","v":false},{"$f":"IF(ISNA(VLOOKUP($B8,GAZ,AB$7,FALSE)),\"\",VLOOKUP($B8,GAZ,AB$7,FALSE))","v":""},"",{"$f":"IF(ISNA(VLOOKUP($B8,GAZ,AD$7,FALSE)),\"\",IF($AC8=$AF8,$G8,VLOOKUP($B8,GAZ,AD$7,FALSE)))","v":""},{"$f":"IF(ISNA(VLOOKUP($B8,GAZ,AE$7,FALSE)),\"\",IF($AC8=$AF8,$H8,VLOOKUP($B8,GAZ,AE$7,FALSE)))","v":""},"","",{"$f":"OR($G8<>\"\",$H8<>\"\",$L8<>\"\",$M8<>\"\")","v":false},{"$f":"AND($T8<>\"F\",NOT($AH8),NOT($AC8=$AF8))","v":false},{"$f":"AND($AI8,OR($D8=\"U\",$D8=\"Z\",$D8=\"K\"))","v":false},{"$f":"AND($D8<>\"U\",$D8<>\"Z\",$D8<>\"K\",$R8)","v":true},{"$f":"AND(Zeitmodus=C_Gleitzeit,$U8<>\"F\",OR($B8=\"Sa\",AND($AM8,$I8>=0,NOT($AY8))))","v":true},{"$f":"AND($G8<>\"\",$H8<>\"\")","v":false},{"$f":"OR($K8<>\"\",AND($L8<>\"\",$M8<>\"\"))","v":false},{"$f":"IF($AK8,TagUG,\"\")","v":"00:00:00"},{"$f":"IF($AK8,IF($H8=\"\",IF(AND($L8<>\"\",$L8<$AG8),$L8,IF(AND($M8<>\"\",$M8<$AG8),$M8,TagOG)),$H8),\"\")","v":"23:59:00"},{"$f":"IF($AK8,IF($G8=\"\",$AB8,$G8),\"\")","v":""},{"$f":"IF($AK8,IF(AND($L8<>\"\",$L8<$AG8),$L8,IF(AND($M8<>\"\",$M8<$AG8),$M8,TagOG)),\"\")","v":"23:59:00"},{"$f":"MOD($G8*24,0.25)=0","v":true},{"$f":"AND($AK8,ISNUMBER($G8),$G8>=$AO8,$G8<=$AP8)","v":false},{"$f":"MOD($H8*24,0.25)=0","v":true},{"$f":"AND($AK8,ISNUMBER($H8),$H8>=$AQ8,$H8<=$AR8)","v":false},{"$f":"AND(Zeitmodus=C_Gleitzeit,$B8<>\"Sa\",$G8<>\"\",$G8>$AD8)","v":false},{"$f":"AND(Zeitmodus=C_Gleitzeit,$B8<>\"Sa\",$H8<>\"\",$H8<$AE8)","v":false},{"$f":"AND($U8<>\"F\",OR($AW8,$AX8))","v":false},{"$f":"IF($B8=\"Sa\",IF($H8<>\"\",$H8,TIME(0,0,0)),IF($AL8,IF(AND($H8<>\"\",$H8>$AF8),$H8,$AF8),\"\"))","v":"00:00:00"},{"$f":"IF($AL8,IF($M8<>\"\",$M8,$BC8),\"\")","v":"23:59:00"},{"$f":"IF($B8=\"Sa\",IF($L8=\"\",TIME(0,0,0),$L8),IF($AL8,IF($L8<>\"\",$L8,IF(AND($H8<>\"\",$H8>$AF8),$H8,$AF8)),\"\"))","v":"00:00:00"},{"$f":"IF($AL8,TIME(23,59,0),\"\")","v":"23:59:00"},{"$f":"MOD($L8*24,0.25)=0","v":true},{"$f":"AND($AL8,ISNUMBER($L8),$L8>=$AZ8,$BA8>=$L8)","v":false},{"$f":"MOD($M8*24,0.25)=0","v":true},{"$f":"AND($AL8,ISNUMBER($M8),$M8>=$BB8,$M8<=$BC8)","v":false},{"$f":"IF(AND(ISBLANK($D8),ISBLANK($G8),ISBLANK($H8),ISBLANK($L8),ISBLANK($M8),ISBLANK($P8)),0,1)","v":0}]
[{"$f":"IF($R9,$Q9,\"\")","v":"2023-07-02"},"So"," Wochenende",null,{"$f":"IF(AND($R9,$T9<>\"F\"),IF($AC9=$AF9,\"keine NAZ\",TEXT($AC9,\"hh:mm\")&\"-\"&TEXT($AF9,\"hh:mm\")),\"\")","v":""},"00:00:00",null,null,"",0,{"$f":"IF(AND($U9=\"F\",$AM9),ROUND($V9*24,2),\"\")","v":""},null,null,"",null,null,{"$f":" Q8+1","v":"2023-07-02"},true,"","F","F",0,0,0,true,false,false,"","","","","","",false,{"$f":"AND($T9<>\"F\",NOT($AH9),NOT($AC9=$AF9))","v":false},false,true,{"$f":"AND(Zeitmodus=C_Gleitzeit,$U9<>\"F\",OR($B9=\"Sa\",AND($AM9,$I9>=0,NOT($AY9))))","v":false},false,{"$f":"OR($K9<>\"\",AND($L9<>\"\",$M9<>\"\"))","v":false},"00:00:00","23:59:00",{"$f":"IF($AK9,IF($G9=\"\",TagUG,$G9),\"\")","v":"00:00:00"},"23:59:00",true,false,true,false,false,false,{"$f":"AND($U9<>\"F\",OR($AW9,$AX9))","v":false},"","","","",true,false,true,false,0]
["2023-07-03","Mo"," ",null,"08:00-16:00","08:00:00",null,null,"",0,"",null,null,"",null,null,"2023-07-03",true,"","A","A",0,-0.33333333333333298,0,false,false,true,"07:00:00","08:00:00","09:00:00","14:00:00","16:00:00","18:00:00",false,true,false,true,false,false,false,"00:00:00","23:59:00","00:00:00","23:59:00",true,false,true,false,false,false,false,"","","","",true,false,true,false,0]
["2023-07-04","Di"," ",null,"08:00-16:00","08:00:00",null,null,"",0,"",null,null,"",null,null,"2023-07-04",true,"","A","A",0,-0.33333333333333298,0,false,false,true,"07:00:00","08:00:00","09:00:00","14:00:00","16:00:00","18:00:00",false,true,false,true,false,false,false,"00:00:00","23:59:00","00:00:00","23:59:00",true,false,true,false,false,false,false,"","","","",true,false,true,false,0]
["2023-07-05","Mi"," ",null,"08:00-16:00","08:00:00",null,null,"",0,"",null,null,"",null,null,"2023-07-05",true,"","A","A",0,-0.33333333333333298,0,false,false,true,"07:00:00","08:00:00","09:00:00","14:00:00","16:00:00","18:00:00",false,true,false,true,false,false,false,"00:00:00","23:59:00","00:00:00","23:59:00",true,false,true,false,false,false,false,"","","","",true,false,true,false,0]
["2023-07-06","Do"," ",null,"08:00-16:00","08:00:00",null,null,"",0,"",null,null,"",null,null,"2023-07-06",true,"","A","A",0,-0.33333333333333298,0,false,false,true,"07:00:00","08:00:00","09:00:00","14:00:00","16:00:00","18:00:00",false,true,false,true,false,false,false,"00:00:00","23:59:00","00:00:00","23:59:00",true,false,true,false,false,false,false,"","","","",true,false,true,false,0]
["2023-07-07","Fr"," ",null,"08:00-16:00","08:00:00",null,null,"",0,"",null,null,"",null,null,"2023-07-07",true,"","A","A",0,-0.33333333333333298,0,false,false,true,"07:00:00","08:00:00","09:00:00","12:00:00","16:00:00","18:00:00",false,true,false,true,false,false,false,"00:00:00","23:59:00","00:00:00","23:59:00",true,false,true,false,false,false,false,"","","","",true,false,true,false,0]
["2023-07-08","Sa"," Wochenende",null,"","00:00:00",null,null,"",0,"",null,null,"",null,null,"2023-07-08",true,"","F","A",0,0,0,true,false,false,"","","","","","",false,false,false,true,true,false,false,"00:00:00","23:59:00","00:00:00","23:59:00",true,false,true,false,false,false,false,"00:00:00","23:59:00","00:00:00","23:59:00",true,false,true,false,0]
["2023-07-09","So"," Wochenende",null,"","00:00:00",null,null,"",0,"",null,null,"",null,null,"2023-07-09",true,"","F","F",0,0,0,true,false,false,"","","","","","",false,false,false,true,false,false,false,"00:00:00","23:59:00","00:00:00","23:59:00",true,false,true,false,false,false,false,"","","","",true,false,true,false,0]
["2023-07-10","Mo"," ",null,"08:00-16:00","08:00:00",null,null,"",0,"",null,null,"",null,null,"2023-07-10",true,"","A","A",0,-0.33333333333333298,0,false,false,true,"07:00:00","08:00:00","09:00:00","14:00:00","16:00:00","18:00:00",false,true,false,true,false,false,false,"00:00:00","23:59:00","00:00:00","23:59:00",true,false,true,false,false,false,false,"","","","",true,false,true,false,0]
["2023-07-11","Di"," ",null,"08:00-16:00","08:00:00",null,null,"",0,"",null,null,"",null,null,"2023-07-11",true,"","A","A",0,-0.33333333333333298,0,false,false,true,"07:00:00","08:00:00","09:00:00","14:00:00","16:00:00","18:00:00",false,true,false,true,false,false,false,"00:00:00","23:59:00","00:00:00","23:59:00",true,false,true,false,false,false,false,"","","","",true,false,true,false,0]
["2023-07-12","Mi"," ",null,"08:00-16:00","08:00:00",null,null,"",0,"",null,null,"",null,null,"2023-07-12",true,"","A","A",0,-0.33333333333333298,0,false,false,true,"07:00:00","08:00:00","09:00:00","14:00:00","16:00:00","18:00:00",false,true,false,true,false,false,false,"00:00:00","23:59:00","00:00:00","23:59:00",true,false,true,false,false,false,false,"","","","",true,false,true,false,0]
["2023-07-13","Do"," ",null,"08:00-16:00","08:00:00",null,null,"",0,"",null,null,"",null,null,"2023-07-13",true,"","A","A",0,-0.33333333333333298,0,false,false,true,"07:00:00","08:00:00","09:00:00","14:00:00","16:00:00","18:00:00",false,true,false,true,false,false,false,"00:00:00","23:59:00","00:00:00","23:59:00",true,false,true,false,false,false,false,"","","","",true,false,true,false,0]
["2023-07-14","Fr"," ",null,"08:00-16:00","08:00:00",null,null,"",0,"",null,null,"",null,null,"2023-07-14",true,"","A","A",0,-0.33333333333333298,0,false,false,true,"07:00:00","08:00:00","09:00:00","12:00:00","16:00:00","18:00:00",false,true,false,true,false,false,false,"00:00:00","23:59:00","00:00:00","23:59:00",true,false,true,false,false,false,false,"","","","",true,false,true,false,0]
["2023-07-15","Sa"," Wochenende",null,"","00:00:00",null,null,"",0,"",null,null,"",null,null,"2023-07-15",true,"","F","A",0,0,0,true,false,false,"","","","","","",false,false,false,true,true,false,false,"00:00:00","23:59:00","00:00:00","23:59:00",true,false,true,false,false,false,false,"00:00:00","23:59:00","00:00:00","23:59:00",true,false,true,false,0]
["2023-07-16","So"," Wochenende",null,"","00:00:00",null,null,"",0,"",null,null,"",null,null,"2023-07-16",true,"","F","F",0,0,0,true,false,false,"","","","","","",false,false,false,true,false,false,false,"00:00:00","23:59:00","00:00:00","23:59:00",true,false,true,false,false,false,false,"","","","",true,false,true,false,0]
["2023-07-17","Mo"," ",null,"08:00-16:00","08:00:00",null,null,"",0,"",null,null,"",null,null,"2023-07-17",true,"","A","A",0,-0.33333333333333298,0,false,false,true,{"$f":"IF(ISNA(VLOOKUP($B24,GAZ,AB$7,FALSE)),\"\",VLOOKUP($B24,GAZ,AB$7,FALSE))","v":"07:00:00"},"08:00:00","09:00:00","14:00:00","16:00:00","18:00:00",false,true,false,true,false,false,false,"00:00:00","23:59:00","00:00:00","23:59:00",true,false,true,false,false,false,false,"","","","",true,false,true,false,0]
["2023-07-18","Di"," ",null,"08:00-16:00","08:00:00",null,null,"",0,"",null,null,"",null,null,"2023-07-18",true,"","A","A",0,-0.33333333333333298,0,false,false,true,"07:00:00","08:00:00","09:00:00","14:00:00","16:00:00","18:00:00",false,true,false,true,false,false,false,"00:00:00","23:59:00","00:00:00","23:59:00",true,false,true,false,false,false,false,"","","","",true,false,true,false,0]
["2023-07-19","Mi"," ",null,"08:00-16:00","08:00:00",null,null,"",0,"",null,null,"",null,null,"2023-07-19",true,"","A","A",0,-0.33333333333333298,0,false,false,true,"07:00:00","08:00:00","09:00:00","14:00:00","16:00:00","18:00:00",false,true,false,true,false,false,false,"00:00:00","23:59:00","00:00:00","23:59:00",true,false,true,false,false,false,false,"","","","",true,false,true,false,0]
["2023-07-20","Do"," ",null,"08:00-16:00","08:00:00",null,null,"",0,"",null,null,"",null,null,"2023-07-20",true,"","A","A",0,-0.33333333333333298,0,false,false,true,"07:00:00","08:00:00","09:00:00","14:00:00","16:00:00","18:00:00",false,true,false,true,false,false,false,"00:00:00","23:59:00","00:00:00","23:59:00",true,false,true,false,false,false,false,"","","","",true,false,true,false,0]
["2023-07-21","Fr"," ",null,"08:00-16:00","08:00:00",null,null,"",0,"",null,null,"",null,null,"2023-07-21",true,"","A","A",0,-0.33333333333333298,0,false,false,true,"07:00:00","08:00:00","09:00:00","12:00:00","16:00:00","18:00:00",false,true,false,true,false,false,false,"00:00:00","23:59:00","00:00:00","23:59:00",true,false,true,false,false,false,false,"","","","",true,false,true,false,0]
["2023-07-22","Sa"," Wochenende",null,"","00:00:00",null,null,"",0,"",null,null,"",null,null,"2023-07-22",true,"","F","A",0,0,0,true,false,false,"","","","","","",false,false,false,true,true,false,false,"00:00:00","23:59:00","00:00:00","23:59:00",true,false,true,false,false,false,false,"00:00:00","23:59:00","00:00:00","23:59:00",true,false,true,false,0]
["2023-07-23","So"," Wochenende",null,"","00:00:00",null,null,"",0,"",null,null,"",null,null,"2023-07-23",true,"","F","F",0,0,0,true,false,false,"","","","","","",false,false,false,true,false,false,false,"00:00:00","23:59:00","00:00:00","23:59:00",true,false,true,false,false,false,false,"","","","",true,false,true,false,0]
["2023-07-24","Mo"," ",null,"08:00-16:00","08:00:00",null,null,"",0,"",null,null,"",null,null,"2023-07-24",true,"","A","A",0,-0.33333333333333298,0,false,false,true,"07:00:00","08:00:00","09:00:00","14:00:00","16:00:00","18:00:00",false,true,false,true,false,false,false,"00:00:00","23:59:00","00:00:00","23:59:00",true,false,true,false,false,false,false,"","","","",true,false,true,false,0]
["2023-07-25","Di"," ",null,"08:00-16:00","08:00:00",null,null,"",0,"",null,null,"",null,null,"2023-07-25",true,"","A","A",0,-0.33333333333333298,0,false,false,true,"07:00:00","08:00:00","09:00:00","14:00:00","16:00:00","18:00:00",false,true,false,true,false,false,false,"00:00:00","23:59:00","00:00:00","23:59:00",true,false,true,false,false,false,false,"","","","",true,false,true,false,0]
["2023-07-26","Mi"," ",null,"08:00-16:00","08:00:00",null,null,"",0,"",null,null,"",null,null,"2023-07-26",true,"","A","A",0,-0.33333333333333298,0,false,false,true,"07:00:00","08:00:00","09:00:00","14:00:00","16:00:00","18:00:00",false,true,false,true,false,false,false,"00:00:00","23:59:00","00:00:00","23:59:00",true,false,true,false,false,false,false,"","","","",true,false,true,false,0]
["2023-07-27","Do"," ",null,"08:00-16:00","08:00:00",null,null,"",0,"",null,null,"",null,null,"2023-07-27",true,"","A","A",0,-0.33333333333333298,0,false,false,true,"07:00:00","08:00:00","09:00:00","14:00:00","16:00:00","18:00:00",false,true,false,true,false,false,false,"00:00:00","23:59:00","00:00:00","23:59:00",true,false,true,false,false,false,false,"","","","",true,false,true,false,0]
["2023-07-28","Fr"," ",null,"08:00-16:00","08:00:00",null,null,"",0,"",null,null,"",null,null,"2023-07-28",true,"","A","A",0,-0.33333333333333298,0,false,false,true,"07:00:00","08:00:00","09:00:00","12:00:00","16:00:00","18:00:00",false,true,false,true,false,false,false,"00:00:00","23:59:00","00:00:00","23:59:00",true,false,true,false,false,false,false,"","","","",true,false,true,false,0]
["2023-07-29","Sa"," Wochenende",null,"","00:00:00",null,null,"",0,"",null,null,"",null,null,"2023-07-29",true,"","F","A",0,0,0,true,false,false,"","","","","","",false,false,false,true,true,false,false,"00:00:00","23:59:00","00:00:00","23:59:00",true,false,true,false,false,false,false,"00:00:00","23:59:00","00:00:00","23:59:00",true,false,true,false,0]
["2023-07-30","So"," Wochenende",null,"","00:00:00",null,null,"",0,"",null,null,"",null,null,"2023-07-30",true,"","F","F",0,0,0,true,false,false,"","","","","","",false,false,false,true,false,false,false,"00:00:00","23:59:00","00:00:00","23:59:00",true,false,true,false,false,false,false,"","","","",true,false,true,false,0]
["2023-07-31","Mo"," ",null,"08:00-16:00","08:00:00",null,null,"",{"$f":"IF($R38,$X38,\"\")","v":0},"",null,null,"",null,null,"2023-07-31",true,"","A","A",0,-0.33333333333333298,0,false,false,true,"07:00:00","08:00:00","09:00:00","14:00:00","16:00:00","18:00:00",false,true,false,true,false,false,false,"00:00:00","23:59:00","00:00:00","23:59:00",true,false,true,false,false,false,false,"","","","",true,false,true,false,0]
["Arbeitstage",{"$f":"COUNTIF(T$8:T$38,\"A\")","v":21},null,null,{"$f":"\"Saldo Monat (~15min) > \"","v":"Saldo Monat (~15min) > "},null,null,null,{"$f":"ROUND(SUM(I8:I38)*4,0)/4","v":0},null,{"$f":"SUM(K8:K38)","v":0}," < ÜS1:2",null,{"$f":"SUM(N8:N38)","v":0},{"$f":"IF(Zeitmodell=\"Vollzeit\",\" < ÜS1:1,5 \",\" < ÜS1:1,25 \")&Zeitmodell","v":" < ÜS1:1,5 Vollzeit"},null,"Zeitmodell Text"]
["Freie Tage",{"$f":"COUNTIF(T$8:T$38,\"F\")","v":10},null,null,{"$f":"\"Saldo \"&IF(Zeitmodell=\"Vollzeit\",\"1:1,5\",\"1:1,25\")& \" (~15min) > \"","v":"Saldo 1:1,5 (~15min) > "},null,null,null,{"$f":"ROUND($N40*4,0)/4","v":0},null,null,null,null,{"$f":"IF(Zeitmodell=\"Vollzeit\",$N39*1.5,$N39*1.25)","v":0},{"$f":"IF(Zeitmodell=\"Vollzeit\",\" < 1:1,5 \",\" < 1:1,25 \")&$Q40","v":" < 1:1,5 Stunden berechnen"},null,"Stunden berechnen"]
["ZK-Tage",0,null,null,"Saldo 1:2 (~15min) > ",null,null,null,{"$f":"ROUND($N41*4,0)/4","v":0},null,null,null,null,{"$f":"K39*2","v":0}," < 1:2    Stunden berechnen"]
["ZA-Tage",{"$f":"COUNTIF(D$8:D$38,\"Z\")","v":0},null,null," Saldo Vormonat > ",null,null,null,{"$f":"$J5","v":0},null,null,null,null,null,null,null,"Gültigkeit ausbezahlt"]
["Urlaubstage",{"$f":"COUNTIF(D$8:D$38,\"U\")","v":0},null,null," Saldo Gesamt > ",null,null,null,{"$f":"SUM(I39:I42)","v":0},null,{"$f":"IF($I$43>=$R$2,\"< Hier ausbezahlte Std. eingeben. (Die Eingabe ist hier erst ab   < einem Saldo von \"&TEXT($R$2,\"#.##0,00\")&\" Std., und nur in 0,25-Schritten möglich.)\",\"\")","v":""},null,null,null,null,null,{"$f":"IF(AND($J$43<>\"\",NOT(ISNUMBER($J$43))),FALSE,OR(AND($J$43>=0,$J$43<=$I$43,MOD($J$43,0.25)=0),$J$43=\"\"))","v":true}]
["Krank",{"$f":"COUNTIF(D$8:D$38,\"K\")","v":0},null,null," Saldo Übertrag > ",null,null,null,{"$f":"$I43-$J43","v":0},{"$f":"\" < Dieser Stunden-Saldo wird in das nächste \"&IF($Q$3=\"Dezember\",\"Jahr\",\"Monat\")&\" übertragen\"","v":" < Dieser Stunden-Saldo wird in das nächste Monat übertragen"}]
[null,null,null,"Z"]
[]
[]
[{"$f":"\"Unterschrift von \"&Vorgesetzter","v":"Unterschrift von Vorname Nachname"},null,null,null,null,null,null,null,null,null,null,{"$f":"\"Unterschrift von \"&Name","v":"Unterschrift von Vorname Nachname"}]

{"sheet":"August","index":8,"n_rows":48,"n_cols":60,"rows_kept":48,"cut":false,"hidden":true,"merged":[[47,0,47,3],[47,11,47,15],[42,4,42,7],[42,10,42,15],[43,4,43,7],[44,4,44,7],[45,4,45,7],[46,4,46,7],[38,2,43,3],[38,4,38,7],[38,11,38,12],[38,14,38,15],[39,4,39,7],[39,14,39,15],[40,4,40,7],[40,14,40,15],[41,4,41,7],[41,10,41,15],[5,7,6,7],[5,10,6,10],[5,11,6,11],[5,12,6,12],[5,13,6,13],[5,27,5,32],[4,2,4,3],[4,4,4,5],[5,2,6,2],[5,3,6,3],[5,5,6,5],[5,6,6,6],[0,15,1,15],[1,5,1,7],[2,5,2,7],[3,0,3,3],[3,4,3,5],[3,6,4,8],[3,14,6,14],[3,15,6,15],[4,0,6,0],[4,1,6,1]]}
[" BOKU-Zeiterfassung für Allgemeines Personal",null,null,null,null,null,null,null,null,null,null,null,null,null,null,null,"Monat","Stunden-Saldo Grenzen","Status Blatteingabe"]
[{"$f":"\" Org.-Einh. : \"&OrgEinheit","v":" Org.-Einh. : HXXXXX"},null,null,null,null,"Zeitmodell:",null,null,{"$f":"\" \"&Zeitmodell","v":" Vollzeit"},"Modus:",{"$f":"\" \"&Zeitmodus","v":" Gleitzeit"},null,null,null,null,null,{"$f":"IF(ISNA($Q$4),1,$Q$4)","v":8},{"$f":"IF($Q$2=12,NormalOGDez,NormalOG)","v":71.999999999999986},{"$f":"SUM($BH8:$BH38)","v":0}]
[{"$f":" \" Mitarbeiter/in: \"&Name","v":" Mitarbeiter/in: Vorname Nachname"},null,null,null,null,"Vorgesetzte/r:",null,null,{"$f":"\" \"&Vorgesetzter","v":" Vorname Nachname"},null,null,null,null,null,null,null,{"$f":"RIGHT(CELL(\"filename\",A1),LEN(CELL(\"filename\",A1))-SEARCH(\"]\",CELL(\"filename\",A1),1))","v":"August"},{"$f":"IF($Q$2=12,NormalUGDez,NormalUG)","v":-24},{"$f":"IF($Q$2=1,$S$2,$S$2+INDIRECT($S$5))","v":0}]
[{"$f":" \" Monat: \"&$Q$3&\" \"&Jahr","v":" Monat: August 2023"},null,null,null,"Dienstplan",null,"Normalstunden Feiertag-ÜS1:2",null,null,"Übertrag","Überstundenberechnung",null,null,null," Unterschrift des\n Vorgesetzten","Anmerkungen \n(z.B. Überstunden- notwendigkeit)",{"$f":"IF(ISNA(VLOOKUP($Q$3,MTab,2,FALSE)),1,VLOOKUP($Q$3,MTab,2,FALSE))","v":8},null,"Übertrags Adresse Blatteingabe"]
[" Datum","Wochentag","Tagesinformationen",null,{"$f":"\"Wochen-AZ\"&\" \"&TEXT(WAZ,\"[hh]:mm\")","v":"Wochen-AZ 40:00"},null,null,null,null,{"$f":"IF(ISNA($Q$5),Übertrag,INDIRECT($Q$5))","v":0},"ÜS1:2",{"$f":"IF(Zeitmodell=\"Vollzeit\",\" Überstunden1:1,5\",\" Überstunden1:1,25\")","v":" Überstunden1:1,5"},null,null,null,null,{"$f":"IF(ISNA(VLOOKUP($Q$3,MTab,3,FALSE)),\"Übertrag\",VLOOKUP($Q$3,MTab,3,FALSE))","v":"Juli!$I$44"},null,{"$f":"IF(ISNA(VLOOKUP($Q$3,MTab,4,FALSE)),$Q$3&\"!$S$2\",VLOOKUP($Q$3,MTab,4,FALSE))","v":"Juli!$S$3"}]
[null,null," Feiertage\n Wochenende\n Urlaub, ZA, Krank","[U]rlaub\n[Z]A\n[ZK]\n[K]rank","Normal-","Soll","Von","Bis","Plus","Saldo","Plus","Von","Bis","Plus",null,null,"Hintergrundberechnungen",null,null,null,null,null,null,"Saldo aktuell",null,null,null,"GAZ-Tabellenabbildung",null,null,null,null,null,"Eingabebeprüfungen"]
[null,null,null,null,"Arbeitszeit",null,null,null,"Minus","akuell",null,null,null,null,null,null,"Datum","Monat OK","Abwesenh.","Freie Tage","ÜA-Tage","Std.","Soll-Std.",{"$f":"IF(ISNA($Q$5),Übertrag,INDIRECT($Q$5))","v":0},"Std.-Soll = 0","Std.-Soll > 0","Std.-Soll < 0",{"$f":"I_GAZGRVon","v":2},{"$f":"I_GAZNAZVon","v":3},{"$f":"I_GAZKVon","v":4},{"$f":"I_GAZKBis","v":6},{"$f":"I_GAZNAZBis","v":7},{"$f":"I_GAZGRBis","v":8},"Zeiteingabe","UZK-Eing.\nerlaubt","UZK-Eing.\ngültig","Normalst. ein erlaubt","Überstd. ein erlaubt","Normalstd.\neingegeben","Überstd.\neingegeben","Normal VON möglich OG","Normal VON möglich UG","Normal BIS möglich OG","Normal BIS möglich UG","Normal VON\n15min","Normal VON richtig","Normal BIS\n15min","Normal BIS richtig","ZA-Kern Von","ZA-Kern Bis","ZA-Kern","Über VON Obergrenze","Über VON Untergrenze","Über BIS Obergrenze","Über BIS Untergrenze","Über VON\n15min","Über VON richtig","Überl BIS\n15min","Über BIS richtig","Status Zeilen Eingabe"]
[{"$f":"IF($R8,$Q8,\"\")","v":"2023-08-01"},{"$f":"IF($R8,VLOOKUP(WEEKDAY($Q8,2),WOTA,2,FALSE),\"\")","v":"Di"},{"$f":"IF($R8,\" \"&IF($S8=\"\",VLOOKUP($Q8,FListe,3,FALSE),$S8),\"\")","v":" "},null,{"$f":"IF(AND($R8,$T8<>\"F\"),IF($AC8=$AF8,\"keine NAZ\",TEXT($AC8,\"hh:mm\")&\"-\"&TEXT($AF8,\"hh:mm\")),\"\")","v":"08:00-16:00"},{"$f":"IF($R8,IF($T8=\"F\",0,VLOOKUP($B8,GAZ,I_GAZNAZ,FALSE)),\"\")","v":"08:00:00"},null,null,{"$f":"IF(Zeitmodus=\"Gleitzeit\",IF($U8=\"F\",\"\",IF(AND($R8,$AM8,NOT($Y8)),ROUND(($V8-$F8)*24,2),IF($D8=\"Z\",$F8*-24,\"\"))),IF(OR($D8=\"Z\",AND($AM8,$U8=\"A\",W8<0)),ROUND($W8*24,2),\"\"))","v":""},{"$f":"IF($R8,$X8,\"\")","v":0},{"$f":"IF(AND($U8=\"F\",$AM8),ROUND($V8*24,2),\"\")","v":""},null,null,{"$f":"IF(Zeitmodus=\"Gleitzeit\",IF(AND($R8,$AN8,$M8-$L8<>0,$AL8),ROUND(($M8-$L8)*24,2),\"\"),IF(AND($AM8,$U8=\"A\",W8>0),ROUND(W8*24,2),\"\"))","v":""},null,null,{"$f":"DATE(Jahr,$Q2,1)","v":"2023-08-01"},{"$f":"$Q$2=MONTH($Q8)","v":true},{"$f":"IF(OR($D8=\"U\",$D8=\"Z\",$D8=\"ZK\",$D8=\"K\"),VLOOKUP($D8,UZK,2,FALSE),\"\")","v":""},{"$f":"IF($R8,VLOOKUP($Q8,FListe,4,FALSE),\"\")","v":"A"},{"$f":"IF($R8,VLOOKUP($Q8,FListe,5,FALSE),\"\")","v":"A"},{"$f":"$H8-$G8","v":0},{"$f":"IF($R8,ROUND($V8-$F8,15),\"\")","v":-0.33333333333333298},{"$f":"IF($I8<>\"\",$X7+$I8,$X7)","v":0},{"$f":"($W8=0)","v":false},{"$f":"($W8>0)","v":false},{"$f":"($W8<0)","v":true},{"$f":"IF(ISNA(VLOOKUP($B8,GAZ,AB$7,FALSE)),\"\",VLOOKUP($B8,GAZ,AB$7,FALSE))","v":"07:00:00"},"08:00:00",{"$f":"IF(ISNA(VLOOKUP($B8,GAZ,AD$7,FALSE)),\"\",IF($AC8=$AF8,$G8,VLOOKUP($B8,GAZ,AD$7,FALSE)))","v":"09:00:00"},{"$f":"IF(ISNA(VLOOKUP($B8,GAZ,AE$7,FALSE)),\"\",IF($AC8=$AF8,$H8,VLOOKUP($B8,GAZ,AE$7,FALSE)))","v":"14:00:00"},"16:00:00","18:00:00",{"$f":"OR($G8<>\"\",$H8<>\"\",$L8<>\"\",$M8<>\"\")","v":false},{"$f":"AND($T8<>\"F\",NOT($AH8),NOT($AC8=$AF8))","v":true},{"$f":"AND($AI8,OR($D8=\"U\",$D8=\"Z\",$D8=\"K\"))","v":false},{"$f":"AND($D8<>\"U\",$D8<>\"Z\",$D8<>\"K\",$R8)","v":true},{"$f":"AND(Zeitmodus=C_Gleitzeit,$U8<>\"F\",OR($B8=\"Sa\",AND($AM8,$I8>=0,NOT($AY8))))","v":false},{"$f":"AND($G8<>\"\",$H8<>\"\")","v":false},{"$f":"OR($K8<>\"\",AND($L8<>\"\",$M8<>\"\"))","v":false},{"$f":"IF($AK8,TagUG,\"\")","v":"00:00:00"},{"$f":"IF($AK8,IF($H8=\"\",IF(AND($L8<>\"\",$L8<$AG8),$L8,IF(AND($M8<>\"\",$M8<$AG8),$M8,TagOG)),$H8),\"\")","v":"23:59:00"},{"$f":"IF($AK8,IF($G8=\"\",$AB8,$G8),\"\")","v":"07:00:00"},{"$f":"IF($AK8,IF(AND($L8<>\"\",$L8<$AG8),$L8,IF(AND($M8<>\"\",$M8<$AG8),$M8,TagOG)),\"\")","v":"23:59:00"},{"$f":"MOD($G8*24,0.25)=0","v":true},{"$f":"AND($AK8,ISNUMBER($G8),$G8>=$AO8,$G8<=$AP8)","v":false},{"$f":"MOD($H8*24,0.25)=0","v":true},{"$f":"AND($AK8,ISNUMBER($H8),$H8>=$AQ8,$H8<=$AR8)","v":false},{"$f":"AND(Zeitmodus=C_Gleitzeit,$B8<>\"Sa\",$G8<>\"\",$G8>$AD8)","v":false},{"$f":"AND(Zeitmodus=C_Gleitzeit,$B8<>\"Sa\",$H8<>\"\",$H8<$AE8)","v":false},{"$f":"AND($U8<>\"F\",OR($AW8,$AX8))","v":false},{"$f":"IF($B8=\"Sa\",IF($H8<>\"\",$H8,TIME(0,0,0)),IF($AL8,IF(AND($H8<>\"\",$H8>$AF8),$H8,$AF8),\"\"))","v":""},{"$f":"IF($AL8,IF($M8<>\"\",$M8,$BC8),\"\")","v":""},{"$f":"IF($B8=\"Sa\",IF($L8=\"\",TIME(0,0,0),$L8),IF($AL8,IF($L8<>\"\",$L8,IF(AND($H8<>\"\",$H8>$AF8),$H8,$AF8)),\"\"))","v":""},{"$f":"IF($AL8,TIME(23,59,0),\"\")","v":""},{"$f":"MOD($L8*24,0.25)=0","v":true},{"$f":"AND($AL8,ISNUMBER($L8),$L8>=$AZ8,$BA8>=$L8)","v":false},{"$f":"MOD($M8*24,0.25)=0","v":true},{"$f":"AND($AL8,ISNUMBER($M8),$M8>=$BB8,$M8<=$BC8)","v":false},{"$f":"IF(AND(ISBLANK($D8),ISBLANK($G8),ISBLANK($H8),ISBLANK($L8),ISBLANK($M8),ISBLANK($P8)),0,1)","v":0}]
[{"$f":"IF($R9,$Q9,\"\")","v":"2023-08-02"},"Mi"," ",null,{"$f":"IF(AND($R9,$T9<>\"F\"),IF($AC9=$AF9,\"keine NAZ\",TEXT($AC9,\"hh:mm\")&\"-\"&TEXT($AF9,\"hh:mm\")),\"\")","v":"08:00-16:00"},"08:00:00",null,null,"",0,{"$f":"IF(AND($U9=\"F\",$AM9),ROUND($V9*24,2),\"\")","v":""},null,null,"",null,null,{"$f":" Q8+1","v":"2023-08-02"},true,"","A","A",0,-0.33333333333333298,0,false,false,true,"07:00:00","08:00:00","09:00:00","14:00:00","16:00:00","18:00:00",false,{"$f":"AND($T9<>\"F\",NOT($AH9),NOT($AC9=$AF9))","v":true},false,true,{"$f":"AND(Zeitmodus=C_Gleitzeit,$U9<>\"F\",OR($B9=\"Sa\",AND($AM9,$I9>=0,NOT($AY9))))","v":false},false,{"$f":"OR($K9<>\"\",AND($L9<>\"\",$M9<>\"\"))","v":false},"00:00:00","23:59:00",{"$f":"IF($AK9,IF($G9=\"\",TagUG,$G9),\"\")","v":"00:00:00"},"23:59:00",true,false,true,false,false,false,{"$f":"AND($U9<>\"F\",OR($AW9,$AX9))","v":false},"","","","",true,false,true,false,0]
["2023-08-03","Do"," ",null,"08:00-16:00","08:00:00",null,null,"",0,"",null,null,"",null,null,"2023-08-03",true,"","A","A",0,-0.33333333333333298,0,false,false,true,"07:00:00","08:00:00","09:00:00","14:00:00","16:00:00","18:00:00",false,true,false,true,false,false,false,"00:00:00","23:59:00","00:00:00","23:59:00",true,false,true,false,false,false,false,"","","","",true,false,true,false,0]
["2023-08-04","Fr"," ",null,"08:00-16:00","08:00:00",null,null,"",0,"",null,null,"",null,null,"2023-08-04",true,"","A","A",0,-0.33333333333333298,0,false,false,true,"07:00:00","08:00:00","09:00:00","12:00:00","16:00:00","18:00:00",false,true,false,true,false,false,false,"00:00:00","23:59:00","00:00:00","23:59:00",true,false,true,false,false,false,false,"","","","",true,false,true,false,0]
["2023-08-05","Sa"," Wochenende",null,"","00:00:00",null,null,"",0,"",null,null,"",null,null,"2023-08-05",true,"","F","A",0,0,0,true,false,false,"","","","","","",false,false,false,true,true,false,false,"00:00:00","23:59:00","00:00:00","23:59:00",true,false,true,false,false,false,false,"00:00:00","23:59:00","00:00:00","23:59:00",true,false,true,false,0]
["2023-08-06","So"," Wochenende",null,"","00:00:00",null,null,"",0,"",null,null,"",null,null,"2023-08-06",true,"","F","F",0,0,0,true,false,false,"","","","","","",false,false,false,true,false,false,false,"00:00:00","23:59:00","00:00:00","23:59:00",true,false,true,false,false,false,false,"","","","",true,false,true,false,0]
["2023-08-07","Mo"," ",null,"08:00-16:00","08:00:00",null,null,"",0,"",null,null,"",null,null,"2023-08-07",true,"","A","A",0,-0.33333333333333298,0,false,false,true,"07:00:00","08:00:00","09:00:00","14:00:00","16:00:00","18:00:00",false,true,false,true,false,false,false,"00:00:00","23:59:00","00:00:00","23:59:00",true,false,true,false,false,false,false,"","","","",true,false,true,false,0]
["2023-08-08","Di"," ",null,"08:00-16:00","08:00:00",null,null,"",0,"",null,null,"",null,null,"2023-08-08",true,"","A","A",0,-0.33333333333333298,0,false,false,true,"07:00:00","08:00:00","09:00:00","14:00:00","16:00:00","18:00:00",false,true,false,true,false,false,false,"00:00:00","23:59:00","00:00:00","23:59:00",true,false,true,false,false,false,false,"","","","",true,false,true,false,0]
["2023-08-09","Mi"," ",null,"08:00-16:00","08:00:00",null,null,"",0,"",null,null,"",null,null,"2023-08-09",true,"","A","A",0,-0.33333333333333298,0,false,false,true,"07:00:00","08:00:00","09:00:00","14:00:00","16:00:00","18:00:00",false,true,false,true,false,false,false,"00:00:00","23:59:00","00:00:00","23:59:00",true,false,true,false,false,false,false,"","","","",true,false,true,false,0]
["2023-08-10","Do"," ",null,"08:00-16:00","08:00:00",null,null,"",0,"",null,null,"",null,null,"2023-08-10",true,"","A","A",0,-0.33333333333333298,0,false,false,true,"07:00:00","08:00:00","09:00:00","14:00:00","16:00:00","18:00:00",false,true,false,true,false,false,false,"00:00:00","23:59:00","00:00:00","23:59:00",true,false,true,false,false,false,false,"","","","",true,false,true,false,0]
["2023-08-11","Fr"," ",null,"08:00-16:00","08:00:00",null,null,"",0,"",null,null,"",null,null,"2023-08-11",true,"","A","A",0,-0.33333333333333298,0,false,false,true,"07:00:00","08:00:00","09:00:00","12:00:00","16:00:00","18:00:00",false,true,false,true,false,false,false,"00:00:00","23:59:00","00:00:00","23:59:00",true,false,true,false,false,false,false,"","","","",true,false,true,false,0]
["2023-08-12","Sa"," Wochenende",null,"","00:00:00",null,null,"",0,"",null,null,"",null,null,"2023-08-12",true,"","F","A",0,0,0,true,false,false,"","","","","","",false,false,false,true,true,false,false,"00:00:00","23:59:00","00:00:00","23:59:00",true,false,true,false,false,false,false,"00:00:00","23:59:00","00:00:00","23:59:00",true,false,true,false,0]
["2023-08-13","So"," Wochenende",null,"","00:00:00",null,null,"",0,"",null,null,"",null,null,"2023-08-13",true,"","F","F",0,0,0,true,false,false,"","","","","","",false,false,false,true,false,false,false,"00:00:00","23:59:00","00:00:00","23:59:00",true,false,true,false,false,false,false,"","","","",true,false,true,false,0]
["2023-08-14","Mo"," ",null,"08:00-16:00","08:00:00",null,null,"",0,"",null,null,"",null,null,"2023-08-14",true,"","A","A",0,-0.33333333333333298,0,false,false,true,"07:00:00","08:00:00","09:00:00","14:00:00","16:00:00","18:00:00",false,true,false,true,false,false,false,"00:00:00","23:59:00","00:00:00","23:59:00",true,false,true,false,false,false,false,"","","","",true,false,true,false,0]
["2023-08-15","Di"," Maria Himmelfahrt",null,"","00:00:00",null,null,"",0,"",null,null,"",null,null,"2023-08-15",true,"","F","F",0,0,0,true,false,false,"07:00:00","08:00:00","09:00:00","14:00:00","16:00:00","18:00:00",false,false,false,true,false,false,false,"00:00:00","23:59:00","00:00:00","23:59:00",true,false,true,false,false,false,false,"","","","",true,false,true,false,0]
["2023-08-16","Mi"," ",null,"08:00-16:00","08:00:00",null,null,"",0,"",null,null,"",null,null,"2023-08-16",true,"","A","A",0,-0.33333333333333298,0,false,false,true,"07:00:00","08:00:00","09:00:00","14:00:00","16:00:00","18:00:00",false,true,false,true,false,false,false,"00:00:00","23:59:00","00:00:00","23:59:00",true,false,true,false,false,false,false,"","","","",true,false,true,false,0]
["2023-08-17","Do"," ",null,"08:00-16:00","08:00:00",null,null,"",0,"",null,null,"",null,null,"2023-08-17",true,"","A","A",0,-0.33333333333333298,0,false,false,true,{"$f":"IF(ISNA(VLOOKUP($B24,GAZ,AB$7,FALSE)),\"\",VLOOKUP($B24,GAZ,AB$7,FALSE))","v":"07:00:00"},"08:00:00","09:00:00","14:00:00","16:00:00","18:00:00",false,true,false,true,false,false,false,"00:00:00","23:59:00","00:00:00","23:59:00",true,false,true,false,false,false,false,"","","","",true,false,true,false,0]
["2023-08-18","Fr"," ",null,"08:00-16:00","08:00:00",null,null,"",0,"",null,null,"",null,null,"2023-08-18",true,"","A","A",0,-0.33333333333333298,0,false,false,true,"07:00:00","08:00:00","09:00:00","12:00:00","16:00:00","18:00:00",false,true,false,true,false,false,false,"00:00:00","23:59:00","00:00:00","23:59:00",true,false,true,false,false,false,false,"","","","",true,false,true,false,0]
["2023-08-19","Sa"," Wochenende",null,"","00:00:00",null,null,"",0,"",null,null,"",null,null,"2023-08-19",true,"","F","A",0,0,0,true,false,false,"","","","","","",false,false,false,true,true,false,false,"00:00:00","23:59:00","00:00:00","23:59:00",true,false,true,false,false,false,false,"00:00:00","23:59:00","00:00:00","23:59:00",true,false,true,false,0]
["2023-08-20","So"," Wochenende",null,"","00:00:00",null,null,"",0,"",null,null,"",null,null,"2023-08-20",true,"","F","F",0,0,0,true,false,false,"","","","","","",false,false,false,true,false,false,false,"00:00:00","23:59:00","00:00:00","23:59:00",true,false,true,false,false,false,false,"","","","",true,false,true,false,0]
["2023-08-21","Mo"," ",null,"08:00-16:00","08:00:00",null,null,"",0,"",null,null,"",null,null,"2023-08-21",true,"","A","A",0,-0.33333333333333298,0,false,false,true,"07:00:00","08:00:00","09:00:00","14:00:00","16:00:00","18:00:00",false,true,false,true,false,false,false,"00:00:00","23:59:00","00:00:00","23:59:00",true,false,true,false,false,false,false,"","","","",true,false,true,false,0]
["2023-08-22","Di"," ",null,"08:00-16:00","08:00:00",null,null,"",0,"",null,null,"",null,null,"2023-08-22",true,"","A","A",0,-0.33333333333333298,0,false,false,true,"07:00:00","08:00:00","09:00:00","14:00:00","16:00:00","18:00:00",false,true,false,true,false,false,false,"00:00:00","23:59:00","00:00:00","23:59:00",true,false,true,false,false,false,false,"","","","",true,false,true,false,0]
["2023-08-23","Mi"," ",null,"08:00-16:00","08:00:00",null,null,"",0,"",null,null,"",null,null,"2023-08-23",true,"","A","A",0,-0.33333333333333298,0,false,false,true,"07:00:00","08:00:00","09:00:00","14:00:00","16:00:00","18:00:00",false,true,false,true,false,false,false,"00:00:00","23:59:00","00:00:00","23:59:00",true,false,true,false,false,false,false,"","","","",true,false,true,false,0]
["2023-08-24","Do"," ",null,"08:00-16:00","08:00:00",null,null,"",0,"",null,null,"",null,null,"2023-08-24",true,"","A","A",0,-0.33333333333333298,0,false,false,true,"07:00:00","08:00:00","09:00:00","14:00:00","16:00:00","18:00:00",false,true,false,true,false,false,false,"00:00:00","23:59:00","00:00:00","23:59:00",true,false,true,false,false,false,false,"","","","",true,false,true,false,0]
["2023-08-25","Fr"," ",null,"08:00-16:00","08:00:00",null,null,"",0,"",null,null,"",null,null,"2023-08-25",true,"","A","A",0,-0.33333333333333298,0,false,false,true,"07:00:00","08:00:00","09:00:00","12:00:00","16:00:00","18:00:00",false,true,false,true,false,false,false,"00:00:00","23:59:00","00:00:00","23:59:00",true,false,true,false,false,false,false,"","","","",true,false,true,false,0]
["2023-08-26","Sa"," Wochenende",null,"","00:00:00",null,null,"",0,"",null,null,"",null,null,"2023-08-26",true,"","F","A",0,0,0,true,false,false,"","","","","","",false,false,false,true,true,false,false,"00:00:00","23:59:00","00:00:00","23:59:00",true,false,true,false,false,false,false,"00:00:00","23:59:00","00:00:00","23:59:00",true,false,true,false,0]
["2023-08-27","So"," Wochenende",null,"","00:00:00",null,null,"",0,"",null,null,"",null,null,"2023-08-27",true,"","F","F",0,0,0,true,false,false,"","","","","","",false,false,false,true,false,false,false,"00:00:00","23:59:00","00:00:00","23:59:00",true,false,true,false,false,false,false,"","","","",true,false,true,false,0]
["2023-08-28","Mo"," ",null,"08:00-16:00","08:00:00",null,null,"",0,"",null,null,"",null,null,"2023-08-28",true,"","A","A",0,-0.33333333333333298,0,false,false,true,"07:00:00","08:00:00","09:00:00","14:00:00","16:00:00","18:00:00",false,true,false,true,false,false,false,"00:00:00","23:59:00","00:00:00","23:59:00",true,false,true,false,false,false,false,"","","","",true,false,true,false,0]
["2023-08-29","Di"," ",null,"08:00-16:00","08:00:00",null,null,"",0,"",null,null,"",null,null,"2023-08-29",true,"","A","A",0,-0.33333333333333298,0,false,false,true,"07:00:00","08:00:00","09:00:00","14:00:00","16:00:00","18:00:00",false,true,false,true,false,false,false,"00:00:00","23:59:00","00:00:00","23:59:00",true,false,true,false,false,false,false,"","","","",true,false,true,false,0]
["2023-08-30","Mi"," ",null,"08:00-16:00","08:00:00",null,null,"",0,"",null,null,"",null,null,"2023-08-30",true,"","A","A",0,-0.33333333333333298,0,false,false,true,"07:00:00","08:00:00","09:00:00","14:00:00","16:00:00","18:00:00",false,true,false,true,false,false,false,"00:00:00","23:59:00","00:00:00","23:59:00",true,false,true,false,false,false,false,"","","","",true,false,true,false,0]
["2023-08-31","Do"," ",null,"08:00-16:00","08:00:00",null,null,"",{"$f":"IF($R38,$X38,\"\")","v":0},"",null,null,"",null,null,"2023-08-31",true,"","A","A",0,-0.33333333333333298,0,false,false,true,"07:00:00","08:00:00","09:00:00","14:00:00","16:00:00","18:00:00",false,true,false,true,false,false,false,"00:00:00","23:59:00","00:00:00","23:59:00",true,false,true,false,false,false,false,"","","","",true,false,true,false,0]
["Arbeitstage",{"$f":"COUNTIF(T$8:T$38,\"A\")","v":22},null,null,{"$f":"\"Saldo Monat (~15min) > \"","v":"Saldo Monat (~15min) > "},null,null,null,{"$f":"ROUND(SUM(I8:I38)*4,0)/4","v":0},null,{"$f":"SUM(K8:K38)","v":0}," < ÜS1:2",null,{"$f":"SUM(N8:N38)","v":0},{"$f":"IF(Zeitmodell=\"Vollzeit\",\" < ÜS1:1,5 \",\" < ÜS1:1,25 \")&Zeitmodell","v":" < ÜS1:1,5 Vollzeit"},null,"Zeitmodell Text"]
["Freie Tage",{"$f":"COUNTIF(T$8:T$38,\"F\")","v":9},null,null,{"$f":"\"Saldo \"&IF(Zeitmodell=\"Vollzeit\",\"1:1,5\",\"1:1,25\")& \" (~15min) > \"","v":"Saldo 1:1,5 (~15min) > "},null,null,null,{"$f":"ROUND($N40*4,0)/4","v":0},null,null,null,null,{"$f":"IF(Zeitmodell=\"Vollzeit\",$N39*1.5,$N39*1.25)","v":0},{"$f":"IF(Zeitmodell=\"Vollzeit\",\" < 1:1,5 \",\" < 1:1,25 \")&$Q40","v":" < 1:1,5 Stunden berechnen"},null,"Stunden berechnen"]
["ZK-Tage",0,null,null,"Saldo 1:2 (~15min) > ",null,null,null,{"$f":"ROUND($N41*4,0)/4","v":0},null,null,null,null,{"$f":"K39*2","v":0}," < 1:2    Stunden berechnen"]
["ZA-Tage",{"$f":"COUNTIF(D$8:D$38,\"Z\")","v":0},null,null," Saldo Vormonat > ",null,null,null,{"$f":"$J5","v":0},null,null,null,null,null,null,null,"Gültigkeit ausbezahlt"]
["Urlaubstage",{"$f":"COUNTIF(D$8:D$38,\"U\")","v":0},null,null," Saldo Gesamt > ",null,null,null,{"$f":"SUM(I39:I42)","v":0},null,{"$f":"IF($I$43>=$R$2,\"< Hier ausbezahlte Std. eingeben. (Die Eingabe ist hier erst ab   < einem Saldo von \"&TEXT($R$2,\"#.##0,00\")&\" Std., und nur in 0,25-Schritten möglich.)\",\"\")","v":""},null,null,null,null,null,{"$f":"IF(AND($J$43<>\"\",NOT(ISNUMBER($J$43))),FALSE,OR(AND($J$43>=0,$J$43<=$I$43,MOD($J$43,0.25)=0),$J$43=\"\"))","v":true}]
["Krank",{"$f":"COUNTIF(D$8:D$38,\"K\")","v":0},null,null," Saldo Übertrag > ",null,null,null,{"$f":"$I43-$J43","v":0},{"$f":"\" < Dieser Stunden-Saldo wird in das nächste \"&IF($Q$3=\"Dezember\",\"Jahr\",\"Monat\")&\" übertragen\"","v":" < Dieser Stunden-Saldo wird in das nächste Monat übertragen"}]
[null,null,null,"Z"]
[]
[]
[{"$f":"\"Unterschrift von \"&Vorgesetzter","v":"Unterschrift von Vorname Nachname"},null,null,null,null,null,null,null,null,null,null,{"$f":"\"Unterschrift von \"&Name","v":"Unterschrift von Vorname Nachname"}]

{"sheet":"September","index":9,"n_rows":48,"n_cols":60,"rows_kept":48,"cut":false,"hidden":true,"merged":[[47,0,47,3],[47,11,47,15],[42,4,42,7],[42,10,42,15],[43,4,43,7],[44,4,44,7],[45,4,45,7],[46,4,46,7],[38,2,43,3],[38,4,38,7],[38,11,38,12],[38,14,38,15],[39,4,39,7],[39,14,39,15],[40,4,40,7],[40,14,40,15],[41,4,41,7],[41,10,41,15],[5,7,6,7],[5,10,6,10],[5,11,6,11],[5,12,6,12],[5,13,6,13],[5,27,5,32],[4,2,4,3],[4,4,4,5],[5,2,6,2],[5,3,6,3],[5,5,6,5],[5,6,6,6],[0,15,1,15],[1,5,1,7],[2,5,2,7],[3,0,3,3],[3,4,3,5],[3,6,4,8],[3,14,6,14],[3,15,6,15],[4,0,6,0],[4,1,6,1]]}
[" BOKU-Zeiterfassung für Allgemeines Personal",null,null,null,null,null,null,null,null,null,null,null,null,null,null,null,"Monat","Stunden-Saldo Grenzen","Status Blatteingabe"]
[{"$f":"\" Org.-Einh. : \"&OrgEinheit","v":" Org.-Einh. : HXXXXX"},null,null,null,null,"Zeitmodell:",null,null,{"$f":"\" \"&Zeitmodell","v":" Vollzeit"},"Modus:",{"$f":"\" \"&Zeitmodus","v":" Gleitzeit"},null,null,null,null,null,{"$f":"IF(ISNA($Q$4),1,$Q$4)","v":9},{"$f":"IF($Q$2=12,NormalOGDez,NormalOG)","v":71.999999999999986},{"$f":"SUM($BH8:$BH38)","v":0}]
[{"$f":" \" Mitarbeiter/in: \"&Name","v":" Mitarbeiter/in: Vorname Nachname"},null,null,null,null,"Vorgesetzte/r:",null,null,{"$f":"\" \"&Vorgesetzter","v":" Vorname Nachname"},null,null,null,null,null,null,null,{"$f":"RIGHT(CELL(\"filename\",A1),LEN(CELL(\"filename\",A1))-SEARCH(\"]\",CELL(\"filename\",A1),1))","v":"September"},{"$f":"IF($Q$2=12,NormalUGDez,NormalUG)","v":-24},{"$f":"IF($Q$2=1,$S$2,$S$2+INDIRECT($S$5))","v":0}]
[{"$f":" \" Monat: \"&$Q$3&\" \"&Jahr","v":" Monat: September 2023"},null,null,null,"Dienstplan",null,"Normalstunden Feiertag-ÜS1:2",null,null,"Übertrag","Überstundenberechnung",null,null,null," Unterschrift des\n Vorgesetzten","Anmerkungen \n(z.B. Überstunden- notwendigkeit)",{"$f":"IF(ISNA(VLOOKUP($Q$3,MTab,2,FALSE)),1,VLOOKUP($Q$3,MTab,2,FALSE))","v":9},null,"Übertrags Adresse Blatteingabe"]
[" Datum","Wochentag","Tagesinformationen",null,{"$f":"\"Wochen-AZ\"&\" \"&TEXT(WAZ,\"[hh]:mm\")","v":"Wochen-AZ 40:00"},null,null,null,null,{"$f":"IF(ISNA($Q$5),Übertrag,INDIRECT($Q$5))","v":0},"ÜS1:2",{"$f":"IF(Zeitmodell=\"Vollzeit\",\" Überstunden1:1,5\",\" Überstunden1:1,25\")","v":" Überstunden1:1,5"},null,null,null,null,{"$f":"IF(ISNA(VLOOKUP($Q$3,MTab,3,FALSE)),\"Übertrag\",VLOOKUP($Q$3,MTab,3,FALSE))","v":"August!$I$44"},null,{"$f":"IF(ISNA(VLOOKUP($Q$3,MTab,4,FALSE)),$Q$3&\"!$S$2\",VLOOKUP($Q$3,MTab,4,FALSE))","v":"August!$S$3"}]
[null,null," Feiertage\n Wochenende\n Urlaub, ZA, Krank","[U]rlaub\n[Z]A\n[ZK]\n[K]rank","Normal-","Soll","Von","Bis","Plus","Saldo","Plus","Von","Bis","Plus",null,null,"Hintergrundberechnungen",null,null,null,null,null,null,"Saldo aktuell",null,null,null,"GAZ-Tabellenabbildung",null,null,null,null,null,"Eingabebeprüfungen"]
[null,null,null,null,"Arbeitszeit",null,null,null,"Minus","akuell",null,null,null,null,null,null,"Datum","Monat OK","Abwesenh.","Freie Tage","ÜA-Tage","Std.","Soll-Std.",{"$f":"IF(ISNA($Q$5),Übertrag,INDIRECT($Q$5))","v":0},"Std.-Soll = 0","Std.-Soll > 0","Std.-Soll < 0",{"$f":"I_GAZGRVon","v":2},{"$f":"I_GAZNAZVon","v":3},{"$f":"I_GAZKVon","v":4},{"$f":"I_GAZKBis","v":6},{"$f":"I_GAZNAZBis","v":7},{"$f":"I_GAZGRBis","v":8},"Zeiteingabe","UZK-Eing.\nerlaubt","UZK-Eing.\ngültig","Normalst. ein erlaubt","Überstd. ein erlaubt","Normalstd.\neingegeben","Überstd.\neingegeben","Normal VON möglich OG","Normal VON möglich UG","Normal BIS möglich OG","Normal BIS möglich UG","Normal VON\n15min","Normal VON richtig","Normal BIS\n15min","Normal BIS richtig","ZA-Kern Von","ZA-Kern Bis","ZA-Kern","Über VON Obergrenze","Über VON Untergrenze","Über BIS Obergrenze","Über BIS Untergrenze","Über VON\n15min","Über VON richtig","Überl BIS\n15min","Über BIS richtig","Status Zeilen Eingabe"]
[{"$f":"IF($R8,$Q8,\"\")","v":"2023-09-01"},{"$f":"IF($R8,VLOOKUP(WEEKDAY($Q8,2),WOTA,2,FALSE),\"\")","v":"Fr"},{"$f":"IF($R8,\" \"&IF($S8=\"\",VLOOKUP($Q8,FListe,3,FALSE),$S8),\"\")","v":" "},null,{"$f":"IF(AND($R8,$T8<>\"F\"),IF($AC8=$AF8,\"keine NAZ\",TEXT($AC8,\"hh:mm\")&\"-\"&TEXT($AF8,\"hh:mm\")),\"\")","v":"08:00-16:00"},{"$f":"IF($R8,IF($T8=\"F\",0,VLOOKUP($B8,GAZ,I_GAZNAZ,FALSE)),\"\")","v":"08:00:00"},null,null,{"$f":"IF(Zeitmodus=\"Gleitzeit\",IF($U8=\"F\",\"\",IF(AND($R8,$AM8,NOT($Y8)),ROUND(($V8-$F8)*24,2),IF($D8=\"Z\",$F8*-24,\"\"))),IF(OR($D8=\"Z\",AND($AM8,$U8=\"A\",W8<0)),ROUND($W8*24,2),\"\"))","v":""},{"$f":"IF($R8,$X8,\"\")","v":0},{"$f":"IF(AND($U8=\"F\",$AM8),ROUND($V8*24,2),\"\")","v":""},null,null,{"$f":"IF(Zeitmodus=\"Gleitzeit\",IF(AND($R8,$AN8,$M8-$L8<>0,$AL8),ROUND(($M8-$L8)*24,2),\"\"),IF(AND($AM8,$U8=\"A\",W8>0),ROUND(W8*24,2),\"\"))","v":""},null,null,{"$f":"DATE(Jahr,$Q2,1)","v":"2023-09-01"},{"$f":"$Q$2=MONTH($Q8)","v":true},{"$f":"IF(OR($D8=\"U\",$D8=\"Z\",$D8=\"ZK\",$D8=\"K\"),VLOOKUP($D8,UZK,2,FALSE),\"\")","v":""},{"$f":"IF($R8,VLOOKUP($Q8,FListe,4,FALSE),\"\")","v":"A"},{"$f":"IF($R8,VLOOKUP($Q8,FListe,5,FALSE),\"\")","v":"A"},{"$f":"$H8-$G8","v":0},{"$f":"IF($R8,ROUND($V8-$F8,15),\"\")","v":-0.33333333333333298},{"$f":"IF($I8<>\"\",$X7+$I8,$X7)","v":0},{"$f":"($W8=0)","v":false},{"$f":"($W8>0)","v":false},{"$f":"($W8<0)","v":true},{"$f":"IF(ISNA(VLOOKUP($B8,GAZ,AB$7,FALSE)),\"\",VLOOKUP($B8,GAZ,AB$7,FALSE))","v":"07:00:00"},"08:00:00",{"$f":"IF(ISNA(VLOOKUP($B8,GAZ,AD$7,FALSE)),\"\",IF($AC8=$AF8,$G8,VLOOKUP($B8,GAZ,AD$7,FALSE)))","v":"09:00:00"},{"$f":"IF(ISNA(VLOOKUP($B8,GAZ,AE$7,FALSE)),\"\",IF($AC8=$AF8,$H8,VLOOKUP($B8,GAZ,AE$7,FALSE)))","v":"12:00:00"},"16:00:00","18:00:00",{"$f":"OR($G8<>\"\",$H8<>\"\",$L8<>\"\",$M8<>\"\")","v":false},{"$f":"AND($T8<>\"F\",NOT($AH8),NOT($AC8=$AF8))","v":true},{"$f":"AND($AI8,OR($D8=\"U\",$D8=\"Z\",$D8=\"K\"))","v":false},{"$f":"AND($D8<>\"U\",$D8<>\"Z\",$D8<>\"K\",$R8)","v":true},{"$f":"AND(Zeitmodus=C_Gleitzeit,$U8<>\"F\",OR($B8=\"Sa\",AND($AM8,$I8>=0,NOT($AY8))))","v":false},{"$f":"AND($G8<>\"\",$H8<>\"\")","v":false},{"$f":"OR($K8<>\"\",AND($L8<>\"\",$M8<>\"\"))","v":false},{"$f":"IF($AK8,TagUG,\"\")","v":"00:00:00"},{"$f":"IF($AK8,IF($H8=\"\",IF(AND($L8<>\"\",$L8<$AG8),$L8,IF(AND($M8<>\"\",$M8<$AG8),$M8,TagOG)),$H8),\"\")","v":"23:59:00"},{"$f":"IF($AK8,IF($G8=\"\",$AB8,$G8),\"\")","v":"07:00:00"},{"$f":"IF($AK8,IF(AND($L8<>\"\",$L8<$AG8),$L8,IF(AND($M8<>\"\",$M8<$AG8),$M8,TagOG)),\"\")","v":"23:59:00"},{"$f":"MOD($G8*24,0.25)=0","v":true},{"$f":"AND($AK8,ISNUMBER($G8),$G8>=$AO8,$G8<=$AP8)","v":false},{"$f":"MOD($H8*24,0.25)=0","v":true},{"$f":"AND($AK8,ISNUMBER($H8),$H8>=$AQ8,$H8<=$AR8)","v":false},{"$f":"AND(Zeitmodus=C_Gleitzeit,$B8<>\"Sa\",$G8<>\"\",$G8>$AD8)","v":false},{"$f":"AND(Zeitmodus=C_Gleitzeit,$B8<>\"Sa\",$H8<>\"\",$H8<$AE8)","v":false},{"$f":"AND($U8<>\"F\",OR($AW8,$AX8))","v":false},{"$f":"IF($B8=\"Sa\",IF($H8<>\"\",$H8,TIME(0,0,0)),IF($AL8,IF(AND($H8<>\"\",$H8>$AF8),$H8,$AF8),\"\"))","v":""},{"$f":"IF($AL8,IF($M8<>\"\",$M8,$BC8),\"\")","v":""},{"$f":"IF($B8=\"Sa\",IF($L8=\"\",TIME(0,0,0),$L8),IF($AL8,IF($L8<>\"\",$L8,IF(AND($H8<>\"\",$H8>$AF8),$H8,$AF8)),\"\"))","v":""},{"$f":"IF($AL8,TIME(23,59,0),\"\")","v":""},{"$f":"MOD($L8*24,0.25)=0","v":true},{"$f":"AND($AL8,ISNUMBER($L8),$L8>=$AZ8,$BA8>=$L8)","v":false},{"$f":"MOD($M8*24,0.25)=0","v":true},{"$f":"AND($AL8,ISNUMBER($M8),$M8>=$BB8,$M8<=$BC8)","v":false},{"$f":"IF(AND(ISBLANK($D8),ISBLANK($G8),ISBLANK($H8),ISBLANK($L8),ISBLANK($M8),ISBLANK($P8)),0,1)","v":0}]
[{"$f":"IF($R9,$Q9,\"\")","v":"2023-09-02"},"Sa"," Wochenende",null,{"$f":"IF(AND($R9,$T9<>\"F\"),IF($AC9=$AF9,\"keine NAZ\",TEXT($AC9,\"hh:mm\")&\"-\"&TEXT($AF9,\"hh:mm\")),\"\")","v":""},"00:00:00",null,null,"",0,{"$f":"IF(AND($U9=\"F\",$AM9),ROUND($V9*24,2),\"\")","v":""},null,null,"",null,null,{"$f":" Q8+1","v":"2023-09-02"},true,"","F","A",0,0,0,true,false,false,"","","","","","",false,{"$f":"AND($T9<>\"F\",NOT($AH9),NOT($AC9=$AF9))","v":false},false,true,{"$f":"AND(Zeitmodus=C_Gleitzeit,$U9<>\"F\",OR($B9=\"Sa\",AND($AM9,$I9>=0,NOT($AY9))))","v":true},false,{"$f":"OR($K9<>\"\",AND($L9<>\"\",$M9<>\"\"))","v":false},"00:00:00","23:59:00",{"$f":"IF($AK9,IF($G9=\"\",TagUG,$G9),\"\")","v":"00:00:00"},"23:59:00",true,false,true,false,false,false,{"$f":"AND($U9<>\"F\",OR($AW9,$AX9))","v":false},"00:00:00","23:59:00","00:00:00","23:59:00",true,false,true,false,0]
["2023-09-03","So"," Wochenende",null,"","00:00:00",null,null,"",0,"",null,null,"",null,null,"2023-09-03",true,"","F","F",0,0,0,true,false,false,"","","","","","",false,false,false,true,false,false,false,"00:00:00","23:59:00","00:00:00","23:59:00",true,false,true,false,false,false,false,"","","","",true,false,true,false,0]
["2023-09-04","Mo"," ",null,"08:00-16:00","08:00:00",null,null,"",0,"",null,null,"",null,null,"2023-09-04",true,"","A","A",0,-0.33333333333333298,0,false,false,true,"07:00:00","08:00:00","09:00:00","14:00:00","16:00:00","18:00:00",false,true,false,true,false,false,false,"00:00:00","23:59:00","00:00:00","23:59:00",true,false,true,false,false,false,false,"","","","",true,false,true,false,0]
["2023-09-05","Di"," ",null,"08:00-16:00","08:00:00",null,null,"",0,"",null,null,"",null,null,"2023-09-05",true,"","A","A",0,-0.33333333333333298,0,false,false,true,"07:00:00","08:00:00","09:00:00","14:00:00","16:00:00","18:00:00",false,true,false,true,false,false,false,"00:00:00","23:59:00","00:00:00","23:59:00",true,false,true,false,false,false,false,"","","","",true,false,true,false,0]
["2023-09-06","Mi"," ",null,"08:00-16:00","08:00:00",null,null,"",0,"",null,null,"",null,null,"2023-09-06",true,"","A","A",0,-0.33333333333333298,0,false,false,true,"07:00:00","08:00:00","09:00:00","14:00:00","16:00:00","18:00:00",false,true,false,true,false,false,false,"00:00:00","23:59:00","00:00:00","23:59:00",true,false,true,false,false,false,false,"","","","",true,false,true,false,0]
["2023-09-07","Do"," ",null,"08:00-16:00","08:00:00",null,null,"",0,"",null,null,"",null,null,"2023-09-07",true,"","A","A",0,-0.33333333333333298,0,false,false,true,"07:00:00","08:00:00","09:00:00","14:00:00","16:00:00","18:00:00",false,true,false,true,false,false,false,"00:00:00","23:59:00","00:00:00","23:59:00",true,false,true,false,false,false,false,"","","","",true,false,true,false,0]
["2023-09-08","Fr"," ",null,"08:00-16:00","08:00:00",null,null,"",0,"",null,null,"",null,null,"2023-09-08",true,"","A","A",0,-0.33333333333333298,0,false,false,true,"07:00:00","08:00:00","09:00:00","12:00:00","16:00:00","18:00:00",false,true,false,true,false,false,false,"00:00:00","23:59:00","00:00:00","23:59:00",true,false,true,false,false,false,false,"","","","",true,false,true,false,0]
["2023-09-09","Sa"," Wochenende",null,"","00:00:00",null,null,"",0,"",null,null,"",null,null,"2023-09-09",true,"","F","A",0,0,0,true,false,false,"","","","","","",false,false,false,true,true,false,false,"00:00:00","23:59:00","00:00:00","23:59:00",true,false,true,false,false,false,false,"00:00:00","23:59:00","00:00:00","23:59:00",true,false,true,false,0]
["2023-09-10","So"," Wochenende",null,"","00:00:00",null,null,"",0,"",null,null,"",null,null,"2023-09-10",true,"","F","F",0,0,0,true,false,false,"","","","","","",false,false,false,true,false,false,false,"00:00:00","23:59:00","00:00:00","23:59:00",true,false,true,false,false,false,false,"","","","",true,false,true,false,0]
["2023-09-11","Mo"," ",null,"08:00-16:00","08:00:00",null,null,"",0,"",null,null,"",null,null,"2023-09-11",true,"","A","A",0,-0.33333333333333298,0,false,false,true,"07:00:00","08:00:00","09:00:00","14:00:00","16:00:00","18:00:00",false,true,false,true,false,false,false,"00:00:00","23:59:00","00:00:00","23:59:00",true,false,true,false,false,false,false,"","","","",true,false,true,false,0]
["2023-09-12","Di"," ",null,"08:00-16:00","08:00:00",null,null,"",0,"",null,null,"",null,null,"2023-09-12",true,"","A","A",0,-0.33333333333333298,0,false,false,true,"07:00:00","08:00:00","09:00:00","14:00:00","16:00:00","18:00:00",false,true,false,true,false,false,false,"00:00:00","23:59:00","00:00:00","23:59:00",true,false,true,false,false,false,false,"","","","",true,false,true,false,0]
["2023-09-13","Mi"," ",null,"08:00-16:00","08:00:00",null,null,"",0,"",null,null,"",null,null,"2023-09-13",true,"","A","A",0,-0.33333333333333298,0,false,false,true,"07:00:00","08:00:00","09:00:00","14:00:00","16:00:00","18:00:00",false,true,false,true,false,false,false,"00:00:00","23:59:00","00:00:00","23:59:00",true,false,true,false,false,false,false,"","","","",true,false,true,false,0]
["2023-09-14","Do"," ",null,"08:00-16:00","08:00:00",null,null,"",0,"",null,null,"",null,null,"2023-09-14",true,"","A","A",0,-0.33333333333333298,0,false,false,true,"07:00:00","08:00:00","09:00:00","14:00:00","16:00:00","18:00:00",false,true,false,true,false,false,false,"00:00:00","23:59:00","00:00:00","23:59:00",true,false,true,false,false,false,false,"","","","",true,false,true,false,0]
["2023-09-15","Fr"," ",null,"08:00-16:00","08:00:00",null,null,"",0,"",null,null,"",null,null,"2023-09-15",true,"","A","A",0,-0.33333333333333298,0,false,false,true,"07:00:00","08:00:00","09:00:00","12:00:00","16:00:00","18:00:00",false,true,false,true,false,false,false,"00:00:00","23:59:00","00:00:00","23:59:00",true,false,true,false,false,false,false,"","","","",true,false,true,false,0]
["2023-09-16","Sa"," Wochenende",null,"","00:00:00",null,null,"",0,"",null,null,"",null,null,"2023-09-16",true,"","F","A",0,0,0,true,false,false,"","","","","","",false,false,false,true,true,false,false,"00:00:00","23:59:00","00:00:00","23:59:00",true,false,true,false,false,false,false,"00:00:00","23:59:00","00:00:00","23:59:00",true,false,true,false,0]
["2023-09-17","So"," Wochenende",null,"","00:00:00",null,null,"",0,"",null,null,"",null,null,"2023-09-17",true,"","F","F",0,0,0,true,false,false,{"$f":"IF(ISNA(VLOOKUP($B24,GAZ,AB$7,FALSE)),\"\",VLOOKUP($B24,GAZ,AB$7,FALSE))","v":""},"","","","","",false,false,false,true,false,false,false,"00:00:00","23:59:00","00:00:00","23:59:00",true,false,true,false,false,false,false,"","","","",true,false,true,false,0]
["2023-09-18","Mo"," ",null,"08:00-16:00","08:00:00",null,null,"",0,"",null,null,"",null,null,"2023-09-18",true,"","A","A",0,-0.33333333333333298,0,false,false,true,"07:00:00","08:00:00","09:00:00","14:00:00","16:00:00","18:00:00",false,true,false,true,false,false,false,"00:00:00","23:59:00","00:00:00","23:59:00",true,false,true,false,false,false,false,"","","","",true,false,true,false,0]
["2023-09-19","Di"," ",null,"08:00-16:00","08:00:00",null,null,"",0,"",null,null,"",null,null,"2023-09-19",true,"","A","A",0,-0.33333333333333298,0,false,false,true,"07:00:00","08:00:00","09:00:00","14:00:00","16:00:00","18:00:00",false,true,false,true,false,false,false,"00:00:00","23:59:00","00:00:00","23:59:00",true,false,true,false,false,false,false,"","","","",true,false,true,false,0]
["2023-09-20","Mi"," ",null,"08:00-16:00","08:00:00",null,null,"",0,"",null,null,"",null,null,"2023-09-20",true,"","A","A",0,-0.33333333333333298,0,false,false,true,"07:00:00","08:00:00","09:00:00","14:00:00","16:00:00","18:00:00",false,true,false,true,false,false,false,"00:00:00","23:59:00","00:00:00","23:59:00",true,false,true,false,false,false,false,"","","","",true,false,true,false,0]
["2023-09-21","Do"," ",null,"08:00-16:00","08:00:00",null,null,"",0,"",null,null,"",null,null,"2023-09-21",true,"","A","A",0,-0.33333333333333298,0,false,false,true,"07:00:00","08:00:00","09:00:00","14:00:00","16:00:00","18:00:00",false,true,false,true,false,false,false,"00:00:00","23:59:00","00:00:00","23:59:00",true,false,true,false,false,false,false,"","","","",true,false,true,false,0]
["2023-09-22","Fr"," ",null,"08:00-16:00","08:00:00",null,null,"",0,"",null,null,"",null,null,"2023-09-22",true,"","A","A",0,-0.33333333333333298,0,false,false,true,"07:00:00","08:00:00","09:00:00","12:00:00","16:00:00","18:00:00",false,true,false,true,false,false,false,"00:00:00","23:59:00","00:00:00","23:59:00",true,false,true,false,false,false,false,"","","","",true,false,true,false,0]
["2023-09-23","Sa"," Wochenende",null,"","00:00:00",null,null,"",0,"",null,null,"",null,null,"2023-09-23",true,"","F","A",0,0,0,true,false,false,"","","","","","",false,false,false,true,true,false,false,"00:00:00","23:59:00","00:00:00","23:59:00",true,false,true,false,false,false,false,"00:00:00","23:59:00","00:00:00","23:59:00",true,false,true,false,0]
["2023-09-24","So"," Wochenende",null,"","00:00:00",null,null,"",0,"",null,null,"",null,null,"2023-09-24",true,"","F","F",0,0,0,true,false,false,"","","","","","",false,false,false,true,false,false,false,"00:00:00","23:59:00","00:00:00","23:59:00",true,false,true,false,false,false,false,"","","","",true,false,true,false,0]
["2023-09-25","Mo"," ",null,"08:00-16:00","08:00:00",null,null,"",0,"",null,null,"",null,null,"2023-09-25",true,"","A","A",0,-0.33333333333333298,0,false,false,true,"07:00:00","08:00:00","09:00:00","14:00:00","16:00:00","18:00:00",false,true,false,true,false,false,false,"00:00:00","23:59:00","00:00:00","23:59:00",true,false,true,false,false,false,false,"","","","",true,false,true,false,0]
["2023-09-26","Di"," ",null,"08:00-16:00","08:00:00",null,null,"",0,"",null,null,"",null,null,"2023-09-26",true,"","A","A",0,-0.33333333333333298,0,false,false,true,"07:00:00","08:00:00","09:00:00","14:00:00","16:00:00","18:00:00",false,true,false,true,false,false,false,"00:00:00","23:59:00","00:00:00","23:59:00",true,false,true,false,false,false,false,"","","","",true,false,true,false,0]
["2023-09-27","Mi"," ",null,"08:00-16:00","08:00:00",null,null,"",0,"",null,null,"",null,null,"2023-09-27",true,"","A","A",0,-0.33333333333333298,0,false,false,true,"07:00:00","08:00:00","09:00:00","14:00:00","16:00:00","18:00:00",false,true,false,true,false,false,false,"00:00:00","23:59:00","00:00:00","23:59:00",true,false,true,false,false,false,false,"","","","",true,false,true,false,0]
["2023-09-28","Do"," ",null,"08:00-16:00","08:00:00",null,null,"",0,"",null,null,"",null,null,"2023-09-28",true,"","A","A",0,-0.33333333333333298,0,false,false,true,"07:00:00","08:00:00","09:00:00","14:00:00","16:00:00","18:00:00",false,true,false,true,false,false,false,"00:00:00","23:59:00","00:00:00","23:59:00",true,false,true,false,false,false,false,"","","","",true,false,true,false,0]
["2023-09-29","Fr"," ",null,"08:00-16:00","08:00:00",null,null,"",0,"",null,null,"",null,null,"2023-09-29",true,"","A","A",0,-0.33333333333333298,0,false,false,true,"07:00:00","08:00:00","09:00:00","12:00:00","16:00:00","18:00:00",false,true,false,true,false,false,false,"00:00:00","23:59:00","00:00:00","23:59:00",true,false,true,false,false,false,false,"","","","",true,false,true,false,0]
["2023-09-30","Sa"," Wochenende",null,"","00:00:00",null,null,"",0,"",null,null,"",null,null,"2023-09-30",true,"","F","A",0,0,0,true,false,false,"","","","","","",false,false,false,true,true,false,false,"00:00:00","23:59:00","00:00:00","23:59:00",true,false,true,false,false,false,false,"00:00:00","23:59:00","00:00:00","23:59:00",true,false,true,false,0]
["","","",null,"","",null,null,"",{"$f":"IF($R38,$X38,\"\")","v":""},"",null,null,"",null,null,"2023-10-01",false,"","","",0,"",0,false,true,false,"","","","","","",false,false,false,false,false,false,false,"","","","",true,false,true,false,false,false,false,"","","","",true,false,true,false,0]
["Arbeitstage",{"$f":"COUNTIF(T$8:T$38,\"A\")","v":21},null,null,{"$f":"\"Saldo Monat (~15min) > \"","v":"Saldo Monat (~15min) > "},null,null,null,{"$f":"ROUND(SUM(I8:I38)*4,0)/4","v":0},null,{"$f":"SUM(K8:K38)","v":0}," < ÜS1:2",null,{"$f":"SUM(N8:N38)","v":0},{"$f":"IF(Zeitmodell=\"Vollzeit\",\" < ÜS1:1,5 \",\" < ÜS1:1,25 \")&Zeitmodell","v":" < ÜS1:1,5 Vollzeit"},null,"Zeitmodell Text"]
["Freie Tage",{"$f":"COUNTIF(T$8:T$38,\"F\")","v":9},null,null,{"$f":"\"Saldo \"&IF(Zeitmodell=\"Vollzeit\",\"1:1,5\",\"1:1,25\")& \" (~15min) > \"","v":"Saldo 1:1,5 (~15min) > "},null,null,null,{"$f":"ROUND($N40*4,0)/4","v":0},null,null,null,null,{"$f":"IF(Zeitmodell=\"Vollzeit\",$N39*1.5,$N39*1.25)","v":0},{"$f":"IF(Zeitmodell=\"Vollzeit\",\" < 1:1,5 \",\" < 1:1,25 \")&$Q40","v":" < 1:1,5 Stunden berechnen"},null,"Stunden berechnen"]
["ZK-Tage",0,null,null,"Saldo 1:2 (~15min) > ",null,null,null,{"$f":"ROUND($N41*4,0)/4","v":0},null,null,null,null,{"$f":"K39*2","v":0}," < 1:2    Stunden berechnen"]
["ZA-Tage",{"$f":"COUNTIF(D$8:D$38,\"Z\")","v":0},null,null," Saldo Vormonat > ",null,null,null,{"$f":"$J5","v":0},null,null,null,null,null,null,null,"Gültigkeit ausbezahlt"]
["Urlaubstage",{"$f":"COUNTIF(D$8:D$38,\"U\")","v":0},null,null," Saldo Gesamt > ",null,null,null,{"$f":"SUM(I39:I42)","v":0},null,{"$f":"IF($I$43>=$R$2,\"< Hier ausbezahlte Std. eingeben. (Die Eingabe ist hier erst ab   < einem Saldo von \"&TEXT($R$2,\"#.##0,00\")&\" Std., und nur in 0,25-Schritten möglich.)\",\"\")","v":""},null,null,null,null,null,{"$f":"IF(AND($J$43<>\"\",NOT(ISNUMBER($J$43))),FALSE,OR(AND($J$43>=0,$J$43<=$I$43,MOD($J$43,0.25)=0),$J$43=\"\"))","v":true}]
["Krank",{"$f":"COUNTIF(D$8:D$38,\"K\")","v":0},null,null," Saldo Übertrag > ",null,null,null,{"$f":"$I43-$J43","v":0},{"$f":"\" < Dieser Stunden-Saldo wird in das nächste \"&IF($Q$3=\"Dezember\",\"Jahr\",\"Monat\")&\" übertragen\"","v":" < Dieser Stunden-Saldo wird in das nächste Monat übertragen"}]
[null,null,null,"Z"]
[]
[]
[{"$f":"\"Unterschrift von \"&Vorgesetzter","v":"Unterschrift von Vorname Nachname"},null,null,null,null,null,null,null,null,null,null,{"$f":"\"Unterschrift von \"&Name","v":"Unterschrift von Vorname Nachname"}]

{"sheet":"Oktober","index":10,"n_rows":48,"n_cols":60,"rows_kept":48,"cut":false,"hidden":true,"merged":[[47,0,47,3],[47,11,47,15],[42,4,42,7],[42,10,42,15],[43,4,43,7],[44,4,44,7],[45,4,45,7],[46,4,46,7],[38,2,43,3],[38,4,38,7],[38,11,38,12],[38,14,38,15],[39,4,39,7],[39,14,39,15],[40,4,40,7],[40,14,40,15],[41,4,41,7],[41,10,41,15],[5,7,6,7],[5,10,6,10],[5,11,6,11],[5,12,6,12],[5,13,6,13],[5,27,5,32],[4,2,4,3],[4,4,4,5],[5,2,6,2],[5,3,6,3],[5,5,6,5],[5,6,6,6],[0,15,1,15],[1,5,1,7],[2,5,2,7],[3,0,3,3],[3,4,3,5],[3,6,4,8],[3,14,6,14],[3,15,6,15],[4,0,6,0],[4,1,6,1]]}
[" BOKU-Zeiterfassung für Allgemeines Personal",null,null,null,null,null,null,null,null,null,null,null,null,null,null,null,"Monat","Stunden-Saldo Grenzen","Status Blatteingabe"]
[{"$f":"\" Org.-Einh. : \"&OrgEinheit","v":" Org.-Einh. : HXXXXX"},null,null,null,null,"Zeitmodell:",null,null,{"$f":"\" \"&Zeitmodell","v":" Vollzeit"},"Modus:",{"$f":"\" \"&Zeitmodus","v":" Gleitzeit"},null,null,null,null,null,{"$f":"IF(ISNA($Q$4),1,$Q$4)","v":10},{"$f":"IF($Q$2=12,NormalOGDez,NormalOG)","v":71.999999999999986},{"$f":"SUM($BH8:$BH38)","v":0}]
[{"$f":" \" Mitarbeiter/in: \"&Name","v":" Mitarbeiter/in: Vorname Nachname"},null,null,null,null,"Vorgesetzte/r:",null,null,{"$f":"\" \"&Vorgesetzter","v":" Vorname Nachname"},null,null,null,null,null,null,null,{"$f":"RIGHT(CELL(\"filename\",A1),LEN(CELL(\"filename\",A1))-SEARCH(\"]\",CELL(\"filename\",A1),1))","v":"Oktober"},{"$f":"IF($Q$2=12,NormalUGDez,NormalUG)","v":-24},{"$f":"IF($Q$2=1,$S$2,$S$2+INDIRECT($S$5))","v":0}]
[{"$f":" \" Monat: \"&$Q$3&\" \"&Jahr","v":" Monat: Oktober 2023"},null,null,null,"Dienstplan",null,"Normalstunden Feiertag-ÜS1:2",null,null,"Übertrag","Überstundenberechnung",null,null,null," Unterschrift des\n Vorgesetzten","Anmerkungen \n(z.B. Überstunden- notwendigkeit)",{"$f":"IF(ISNA(VLOOKUP($Q$3,MTab,2,FALSE)),1,VLOOKUP($Q$3,MTab,2,FALSE))","v":10},null,"Übertrags Adresse Blatteingabe"]
[" Datum","Wochentag","Tagesinformationen",null,{"$f":"\"Wochen-AZ\"&\" \"&TEXT(WAZ,\"[hh]:mm\")","v":"Wochen-AZ 40:00"},null,null,null,null,{"$f":"IF(ISNA($Q$5),Übertrag,INDIRECT($Q$5))","v":0},"ÜS1:2",{"$f":"IF(Zeitmodell=\"Vollzeit\",\" Überstunden1:1,5\",\" Überstunden1:1,25\")","v":" Überstunden1:1,5"},null,null,null,null,{"$f":"IF(ISNA(VLOOKUP($Q$3,MTab,3,FALSE)),\"Übertrag\",VLOOKUP($Q$3,MTab,3,FALSE))","v":"September!$I$44"},null,{"$f":"IF(ISNA(VLOOKUP($Q$3,MTab,4,FALSE)),$Q$3&\"!$S$2\",VLOOKUP($Q$3,MTab,4,FALSE))","v":"September!$S$3"}]
[null,null," Feiertage\n Wochenende\n Urlaub, ZA, Krank","[U]rlaub\n[Z]A\n[ZK]\n[K]rank","Normal-","Soll","Von","Bis","Plus","Saldo","Plus","Von","Bis","Plus",null,null,"Hintergrundberechnungen",null,null,null,null,null,null,"Saldo aktuell",null,null,null,"GAZ-Tabellenabbildung",null,null,null,null,null,"Eingabebeprüfungen"]
[null,null,null,null,"Arbeitszeit",null,null,null,"Minus","akuell",null,null,null,null,null,null,"Datum","Monat OK","Abwesenh.","Freie Tage","ÜA-Tage","Std.","Soll-Std.",{"$f":"IF(ISNA($Q$5),Übertrag,INDIRECT($Q$5))","v":0},"Std.-Soll = 0","Std.-Soll > 0","Std.-Soll < 0",{"$f":"I_GAZGRVon","v":2},{"$f":"I_GAZNAZVon","v":3},{"$f":"I_GAZKVon","v":4},{"$f":"I_GAZKBis","v":6},{"$f":"I_GAZNAZBis","v":7},{"$f":"I_GAZGRBis","v":8},"Zeiteingabe","UZK-Eing.\nerlaubt","UZK-Eing.\ngültig","Normalst. ein erlaubt","Überstd. ein erlaubt","Normalstd.\neingegeben","Überstd.\neingegeben","Normal VON möglich OG","Normal VON möglich UG","Normal BIS möglich OG","Normal BIS möglich UG","Normal VON\n15min","Normal VON richtig","Normal BIS\n15min","Normal BIS richtig","ZA-Kern Von","ZA-Kern Bis","ZA-Kern","Über VON Obergrenze","Über VON Untergrenze","Über BIS Obergrenze","Über BIS Untergrenze","Über VON\n15min","Über VON richtig","Überl BIS\n15min","Über BIS richtig","Status Zeilen Eingabe"]
[{"$f":"IF($R8,$Q8,\"\")","v":"2023-10-01"},{"$f":"IF($R8,VLOOKUP(WEEKDAY($Q8,2),WOTA,2,FALSE),\"\")","v":"So"},{"$f":"IF($R8,\" \"&IF($S8=\"\",VLOOKUP($Q8,FListe,3,FALSE),$S8),\"\")","v":" Wochenende"},null,{"$f":"IF(AND($R8,$T8<>\"F\"),IF($AC8=$AF8,\"keine NAZ\",TEXT($AC8,\"hh:mm\")&\"-\"&TEXT($AF8,\"hh:mm\")),\"\")","v":""},{"$f":"IF($R8,IF($T8=\"F\",0,VLOOKUP($B8,GAZ,I_GAZNAZ,FALSE)),\"\")","v":"00:00:00"},null,null,{"$f":"IF(Zeitmodus=\"Gleitzeit\",IF($U8=\"F\",\"\",IF(AND($R8,$AM8,NOT($Y8)),ROUND(($V8-$F8)*24,2),IF($D8=\"Z\",$F8*-24,\"\"))),IF(OR($D8=\"Z\",AND($AM8,$U8=\"A\",W8<0)),ROUND($W8*24,2),\"\"))","v":""},{"$f":"IF($R8,$X8,\"\")","v":0},{"$f":"IF(AND($U8=\"F\",$AM8),ROUND($V8*24,2),\"\")","v":""},null,null,{"$f":"IF(Zeitmodus=\"Gleitzeit\",IF(AND($R8,$AN8,$M8-$L8<>0,$AL8),ROUND(($M8-$L8)*24,2),\"\"),IF(AND($AM8,$U8=\"A\",W8>0),ROUND(W8*24,2),\"\"))","v":""},null,null,{"$f":"DATE(Jahr,$Q2,1)","v":"2023-10-01"},{"$f":"$Q$2=MONTH($Q8)","v":true},{"$f":"IF(OR($D8=\"U\",$D8=\"Z\",$D8=\"ZK\",$D8=\"K\"),VLOOKUP($D8,UZK,2,FALSE),\"\")","v":""},{"$f":"IF($R8,VLOOKUP($Q8,FListe,4,FALSE),\"\")","v":"F"},{"$f":"IF($R8,VLOOKUP($Q8,FListe,5,FALSE),\"\")","v":"F"},{"$f":"$H8-$G8","v":0},{"$f":"IF($R8,ROUND($V8-$F8,15),\"\")","v":0},{"$f":"IF($I8<>\"\",$X7+$I8,$X7)","v":0},{"$f":"($W8=0)","v":true},{"$f":"($W8>0)","v":false},{"$f":"($W8<0)","v":false},{"$f":"IF(ISNA(VLOOKUP($B8,GAZ,AB$7,FALSE)),\"\",VLOOKUP($B8,GAZ,AB$7,FALSE))","v":""},"",{"$f":"IF(ISNA(VLOOKUP($B8,GAZ,AD$7,FALSE)),\"\",IF($AC8=$AF8,$G8,VLOOKUP($B8,GAZ,AD$7,FALSE)))","v":""},{"$f":"IF(ISNA(VLOOKUP($B8,GAZ,AE$7,FALSE)),\"\",IF($AC8=$AF8,$H8,VLOOKUP($B8,GAZ,AE$7,FALSE)))","v":""},"","",{"$f":"OR($G8<>\"\",$H8<>\"\",$L8<>\"\",$M8<>\"\")","v":false},{"$f":"AND($T8<>\"F\",NOT($AH8),NOT($AC8=$AF8))","v":false},{"$f":"AND($AI8,OR($D8=\"U\",$D8=\"Z\",$D8=\"K\"))","v":false},{"$f":"AND($D8<>\"U\",$D8<>\"Z\",$D8<>\"K\",$R8)","v":true},{"$f":"AND(Zeitmodus=C_Gleitzeit,$U8<>\"F\",OR($B8=\"Sa\",AND($AM8,$I8>=0,NOT($AY8))))","v":false},{"$f":"AND($G8<>\"\",$H8<>\"\")","v":false},{"$f":"OR($K8<>\"\",AND($L8<>\"\",$M8<>\"\"))","v":false},{"$f":"IF($AK8,TagUG,\"\")","v":"00:00:00"},{"$f":"IF($AK8,IF($H8=\"\",IF(AND($L8<>\"\",$L8<$AG8),$L8,IF(AND($M8<>\"\",$M8<$AG8),$M8,TagOG)),$H8),\"\")","v":"23:59:00"},{"$f":"IF($AK8,IF($G8=\"\",$AB8,$G8),\"\")","v":""},{"$f":"IF($AK8,IF(AND($L8<>\"\",$L8<$AG8),$L8,IF(AND($M8<>\"\",$M8<$AG8),$M8,TagOG)),\"\")","v":"23:59:00"},{"$f":"MOD($G8*24,0.25)=0","v":true},{"$f":"AND($AK8,ISNUMBER($G8),$G8>=$AO8,$G8<=$AP8)","v":false},{"$f":"MOD($H8*24,0.25)=0","v":true},{"$f":"AND($AK8,ISNUMBER($H8),$H8>=$AQ8,$H8<=$AR8)","v":false},{"$f":"AND(Zeitmodus=C_Gleitzeit,$B8<>\"Sa\",$G8<>\"\",$G8>$AD8)","v":false},{"$f":"AND(Zeitmodus=C_Gleitzeit,$B8<>\"Sa\",$H8<>\"\",$H8<$AE8)","v":false},{"$f":"AND($U8<>\"F\",OR($AW8,$AX8))","v":false},{"$f":"IF($B8=\"Sa\",IF($H8<>\"\",$H8,TIME(0,0,0)),IF($AL8,IF(AND($H8<>\"\",$H8>$AF8),$H8,$AF8),\"\"))","v":""},{"$f":"IF($AL8,IF($M8<>\"\",$M8,$BC8),\"\")","v":""},{"$f":"IF($B8=\"Sa\",IF($L8=\"\",TIME(0,0,0),$L8),IF($AL8,IF($L8<>\"\",$L8,IF(AND($H8<>\"\",$H8>$AF8),$H8,$AF8)),\"\"))","v":""},{"$f":"IF($AL8,TIME(23,59,0),\"\")","v":""},{"$f":"MOD($L8*24,0.25)=0","v":true},{"$f":"AND($AL8,ISNUMBER($L8),$L8>=$AZ8,$BA8>=$L8)","v":false},{"$f":"MOD($M8*24,0.25)=0","v":true},{"$f":"AND($AL8,ISNUMBER($M8),$M8>=$BB8,$M8<=$BC8)","v":false},{"$f":"IF(AND(ISBLANK($D8),ISBLANK($G8),ISBLANK($H8),ISBLANK($L8),ISBLANK($M8),ISBLANK($P8)),0,1)","v":0}]
[{"$f":"IF($R9,$Q9,\"\")","v":"2023-10-02"},"Mo"," ",null,{"$f":"IF(AND($R9,$T9<>\"F\"),IF($AC9=$AF9,\"keine NAZ\",TEXT($AC9,\"hh:mm\")&\"-\"&TEXT($AF9,\"hh:mm\")),\"\")","v":"08:00-16:00"},"08:00:00",null,null,"",0,{"$f":"IF(AND($U9=\"F\",$AM9),ROUND($V9*24,2),\"\")","v":""},null,null,"",null,null,{"$f":" Q8+1","v":"2023-10-02"},true,"","A","A",0,-0.33333333333333298,0,false,false,true,"07:00:00","08:00:00","09:00:00","14:00:00","16:00:00","18:00:00",false,{"$f":"AND($T9<>\"F\",NOT($AH9),NOT($AC9=$AF9))","v":true},false,true,{"$f":"AND(Zeitmodus=C_Gleitzeit,$U9<>\"F\",OR($B9=\"Sa\",AND($AM9,$I9>=0,NOT($AY9))))","v":false},false,{"$f":"OR($K9<>\"\",AND($L9<>\"\",$M9<>\"\"))","v":false},"00:00:00","23:59:00",{"$f":"IF($AK9,IF($G9=\"\",TagUG,$G9),\"\")","v":"00:00:00"},"23:59:00",true,false,true,false,false,false,{"$f":"AND($U9<>\"F\",OR($AW9,$AX9))","v":false},"","","","",true,false,true,false,0]
["2023-10-03","Di"," ",null,"08:00-16:00","08:00:00",null,null,"",0,"",null,null,"",null,null,"2023-10-03",true,"","A","A",0,-0.33333333333333298,0,false,false,true,"07:00:00","08:00:00","09:00:00","14:00:00","16:00:00","18:00:00",false,true,false,true,false,false,false,"00:00:00","23:59:00","00:00:00","23:59:00",true,false,true,false,false,false,false,"","","","",true,false,true,false,0]
["2023-10-04","Mi"," ",null,"08:00-16:00","08:00:00",null,null,"",0,"",null,null,"",null,null,"2023-10-04",true,"","A","A",0,-0.33333333333333298,0,false,false,true,"07:00:00","08:00:00","09:00:00","14:00:00","16:00:00","18:00:00",false,true,false,true,false,false,false,"00:00:00","23:59:00","00:00:00","23:59:00",true,false,true,false,false,false,false,"","","","",true,false,true,false,0]
["2023-10-05","Do"," ",null,"08:00-16:00","08:00:00",null,null,"",0,"",null,null,"",null,null,"2023-10-05",true,"","A","A",0,-0.33333333333333298,0,false,false,true,"07:00:00","08:00:00","09:00:00","14:00:00","16:00:00","18:00:00",false,true,false,true,false,false,false,"00:00:00","23:59:00","00:00:00","23:59:00",true,false,true,false,false,false,false,"","","","",true,false,true,false,0]
["2023-10-06","Fr"," ",null,"08:00-16:00","08:00:00",null,null,"",0,"",null,null,"",null,null,"2023-10-06",true,"","A","A",0,-0.33333333333333298,0,false,false,true,"07:00:00","08:00:00","09:00:00","12:00:00","16:00:00","18:00:00",false,true,false,true,false,false,false,"00:00:00","23:59:00","00:00:00","23:59:00",true,false,true,false,false,false,false,"","","","",true,false,true,false,0]
["2023-10-07","Sa"," Wochenende",null,"","00:00:00",null,null,"",0,"",null,null,"",null,null,"2023-10-07",true,"","F","A",0,0,0,true,false,false,"","","","","","",false,false,false,true,true,false,false,"00:00:00","23:59:00","00:00:00","23:59:00",true,false,true,false,false,false,false,"00:00:00","23:59:00","00:00:00","23:59:00",true,false,true,false,0]
["2023-10-08","So"," Wochenende",null,"","00:00:00",null,null,"",0,"",null,null,"",null,null,"2023-10-08",true,"","F","F",0,0,0,true,false,false,"","","","","","",false,false,false,true,false,false,false,"00:00:00","23:59:00","00:00:00","23:59:00",true,false,true,false,false,false,false,"","","","",true,false,true,false,0]
["2023-10-09","Mo"," ",null,"08:00-16:00","08:00:00",null,null,"",0,"",null,null,"",null,null,"2023-10-09",true,"","A","A",0,-0.33333333333333298,0,false,false,true,"07:00:00","08:00:00","09:00:00","14:00:00","16:00:00","18:00:00",false,true,false,true,false,false,false,"00:00:00","23:59:00","00:00:00","23:59:00",true,false,true,false,false,false,false,"","","","",true,false,true,false,0]
["2023-10-10","Di"," ",null,"08:00-16:00","08:00:00",null,null,"",0,"",null,null,"",null,null,"2023-10-10",true,"","A","A",0,-0.33333333333333298,0,false,false,true,"07:00:00","08:00:00","09:00:00","14:00:00","16:00:00","18:00:00",false,true,false,true,false,false,false,"00:00:00","23:59:00","00:00:00","23:59:00",true,false,true,false,false,false,false,"","","","",true,false,true,false,0]
["2023-10-11","Mi"," ",null,"08:00-16:00","08:00:00",null,null,"",0,"",null,null,"",null,null,"2023-10-11",true,"","A","A",0,-0.33333333333333298,0,false,false,true,"07:00:00","08:00:00","09:00:00","14:00:00","16:00:00","18:00:00",false,true,false,true,false,false,false,"00:00:00","23:59:00","00:00:00","23:59:00",true,false,true,false,false,false,false,"","","","",true,false,true,false,0]
["2023-10-12","Do"," ",null,"08:00-16:00","08:00:00",null,null,"",0,"",null,null,"",null,null,"2023-10-12",true,"","A","A",0,-0.33333333333333298,0,false,false,true,"07:00:00","08:00:00","09:00:00","14:00:00","16:00:00","18:00:00",false,true,false,true,false,false,false,"00:00:00","23:59:00","00:00:00","23:59:00",true,false,true,false,false,false,false,"","","","",true,false,true,false,0]
["2023-10-13","Fr"," ",null,"08:00-16:00","08:00:00",null,null,"",0,"",null,null,"",null,null,"2023-10-13",true,"","A","A",0,-0.33333333333333298,0,false,false,true,"07:00:00","08:00:00","09:00:00","12:00:00","16:00:00","18:00:00",false,true,false,true,false,false,false,"00:00:00","23:59:00","00:00:00","23:59:00",true,false,true,false,false,false,false,"","","","",true,false,true,false,0]
["2023-10-14","Sa"," Wochenende",null,"","00:00:00",null,null,"",0,"",null,null,"",null,null,"2023-10-14",true,"","F","A",0,0,0,true,false,false,"","","","","","",false,false,false,true,true,false,false,"00:00:00","23:59:00","00:00:00","23:59:00",true,false,true,false,false,false,false,"00:00:00","23:59:00","00:00:00","23:59:00",true,false,true,false,0]
["2023-10-15","So"," Wochenende",null,"","00:00:00",null,null,"",0,"",null,null,"",null,null,"2023-10-15",true,"","F","F",0,0,0,true,false,false,"","","","","","",false,false,false,true,false,false,false,"00:00:00","23:59:00","00:00:00","23:59:00",true,false,true,false,false,false,false,"","","","",true,false,true,false,0]
["2023-10-16","Mo"," ",null,"08:00-16:00","08:00:00",null,null,"",0,"",null,null,"",null,null,"2023-10-16",true,"","A","A",0,-0.33333333333333298,0,false,false,true,"07:00:00","08:00:00","09:00:00","14:00:00","16:00:00","18:00:00",false,true,false,true,false,false,false,"00:00:00","23:59:00","00:00:00","23:59:00",true,false,true,false,false,false,false,"","","","",true,false,true,false,0]
["2023-10-17","Di"," ",null,"08:00-16:00","08:00:00",null,null,"",0,"",null,null,"",null,null,"2023-10-17",true,"","A","A",0,-0.33333333333333298,0,false,false,true,{"$f":"IF(ISNA(VLOOKUP($B24,GAZ,AB$7,FALSE)),\"\",VLOOKUP($B24,GAZ,AB$7,FALSE))","v":"07:00:00"},"08:00:00","09:00:00","14:00:00","16:00:00","18:00:00",false,true,false,true,false,false,false,"00:00:00","23:59:00","00:00:00","23:59:00",true,false,true,false,false,false,false,"","","","",true,false,true,false,0]
["2023-10-18","Mi"," ",null,"08:00-16:00","08:00:00",null,null,"",0,"",null,null,"",null,null,"2023-10-18",true,"","A","A",0,-0.33333333333333298,0,false,false,true,"07:00:00","08:00:00","09:00:00","14:00:00","16:00:00","18:00:00",false,true,false,true,false,false,false,"00:00:00","23:59:00","00:00:00","23:59:00",true,false,true,false,false,false,false,"","","","",true,false,true,false,0]
["2023-10-19","Do"," ",null,"08:00-16:00","08:00:00",null,null,"",0,"",null,null,"",null,null,"2023-10-19",true,"","A","A",0,-0.33333333333333298,0,false,false,true,"07:00:00","08:00:00","09:00:00","14:00:00","16:00:00","18:00:00",false,true,false,true,false,false,false,"00:00:00","23:59:00","00:00:00","23:59:00",true,false,true,false,false,false,false,"","","","",true,false,true,false,0]
["2023-10-20","Fr"," ",null,"08:00-16:00","08:00:00",null,null,"",0,"",null,null,"",null,null,"2023-10-20",true,"","A","A",0,-0.33333333333333298,0,false,false,true,"07:00:00","08:00:00","09:00:00","12:00:00","16:00:00","18:00:00",false,true,false,true,false,false,false,"00:00:00","23:59:00","00:00:00","23:59:00",true,false,true,false,false,false,false,"","","","",true,false,true,false,0]
["2023-10-21","Sa"," Wochenende",null,"","00:00:00",null,null,"",0,"",null,null,"",null,null,"2023-10-21",true,"","F","A",0,0,0,true,false,false,"","","","","","",false,false,false,true,true,false,false,"00:00:00","23:59:00","00:00:00","23:59:00",true,false,true,false,false,false,false,"00:00:00","23:59:00","00:00:00","23:59:00",true,false,true,false,0]
["2023-10-22","So"," Wochenende",null,"","00:00:00",null,null,"",0,"",null,null,"",null,null,"2023-10-22",true,"","F","F",0,0,0,true,false,false,"","","","","","",false,false,false,true,false,false,false,"00:00:00","23:59:00","00:00:00","23:59:00",true,false,true,false,false,false,false,"","","","",true,false,true,false,0]
["2023-10-23","Mo"," ",null,"08:00-16:00","08:00:00",null,null,"",0,"",null,null,"",null,null,"2023-10-23",true,"","A","A",0,-0.33333333333333298,0,false,false,true,"07:00:00","08:00:00","09:00:00","14:00:00","16:00:00","18:00:00",false,true,false,true,false,false,false,"00:00:00","23:59:00","00:00:00","23:59:00",true,false,true,false,false,false,false,"","","","",true,false,true,false,0]
["2023-10-24","Di"," ",null,"08:00-16:00","08:00:00",null,null,"",0,"",null,null,"",null,null,"2023-10-24",true,"","A","A",0,-0.33333333333333298,0,false,false,true,"07:00:00","08:00:00","09:00:00","14:00:00","16:00:00","18:00:00",false,true,false,true,false,false,false,"00:00:00","23:59:00","00:00:00","23:59:00",true,false,true,false,false,false,false,"","","","",true,false,true,false,0]
["2023-10-25","Mi"," ",null,"08:00-16:00","08:00:00",null,null,"",0,"",null,null,"",null,null,"2023-10-25",true,"","A","A",0,-0.33333333333333298,0,false,false,true,"07:00:00","08:00:00","09:00:00","14:00:00","16:00:00","18:00:00",false,true,false,true,false,false,false,"00:00:00","23:59:00","00:00:00","23:59:00",true,false,true,false,false,false,false,"","","","",true,false,true,false,0]
["2023-10-26","Do"," Nationalfeiertag",null,"","00:00:00",null,null,"",0,"",null,null,"",null,null,"2023-10-26",true,"","F","F",0,0,0,true,false,false,"07:00:00","08:00:00","09:00:00","14:00:00","16:00:00","18:00:00",false,false,false,true,false,false,false,"00:00:00","23:59:00","00:00:00","23:59:00",true,false,true,false,false,false,false,"","","","",true,false,true,false,0]
["2023-10-27","Fr"," ",null,"08:00-16:00","08:00:00",null,null,"",0,"",null,null,"",null,null,"2023-10-27",true,"","A","A",0,-0.33333333333333298,0,false,false,true,"07:00:00","08:00:00","09:00:00","12:00:00","16:00:00","18:00:00",false,true,false,true,false,false,false,"00:00:00","23:59:00","00:00:00","23:59:00",true,false,true,false,false,false,false,"","","","",true,false,true,false,0]
["2023-10-28","Sa"," Wochenende",null,"","00:00:00",null,null,"",0,"",null,null,"",null,null,"2023-10-28",true,"","F","A",0,0,0,true,false,false,"","","","","","",false,false,false,true,true,false,false,"00:00:00","23:59:00","00:00:00","23:59:00",true,false,true,false,false,false,false,"00:00:00","23:59:00","00:00:00","23:59:00",true,false,true,false,0]
["2023-10-29","So"," Wochenende",null,"","00:00:00",null,null,"",0,"",null,null,"",null,null,"2023-10-29",true,"","F","F",0,0,0,true,false,false,"","","","","","",false,false,false,true,false,false,false,"00:00:00","23:59:00","00:00:00","23:59:00",true,false,true,false,false,false,false,"","","","",true,false,true,false,0]
["2023-10-30","Mo"," ",null,"08:00-16:00","08:00:00",null,null,"",0,"",null,null,"",null,null,"2023-10-30",true,"","A","A",0,-0.33333333333333298,0,false,false,true,"07:00:00","08:00:00","09:00:00","14:00:00","16:00:00","18:00:00",false,true,false,true,false,false,false,"00:00:00","23:59:00","00:00:00","23:59:00",true,false,true,false,false,false,false,"","","","",true,false,true,false,0]
["2023-10-31","Di"," ",null,"08:00-16:00","08:00:00",null,null,"",{"$f":"IF($R38,$X38,\"\")","v":0},"",null,null,"",null,null,"2023-10-31",true,"","A","A",0,-0.33333333333333298,0,false,false,true,"07:00:00","08:00:00","09:00:00","14:00:00","16:00:00","18:00:00",false,true,false,true,false,false,false,"00:00:00","23:59:00","00:00:00","23:59:00",true,false,true,false,false,false,false,"","","","",true,false,true,false,0]
["Arbeitstage",{"$f":"COUNTIF(T$8:T$38,\"A\")","v":21},null,null,{"$f":"\"Saldo Monat (~15min) > \"","v":"Saldo Monat (~15min) > "},null,null,null,{"$f":"ROUND(SUM(I8:I38)*4,0)/4","v":0},null,{"$f":"SUM(K8:K38)","v":0}," < ÜS1:2",null,{"$f":"SUM(N8:N38)","v":0},{"$f":"IF(Zeitmodell=\"Vollzeit\",\" < ÜS1:1,5 \",\" < ÜS1:1,25 \")&Zeitmodell","v":" < ÜS1:1,5 Vollzeit"},null,"Zeitmodell Text"]
["Freie Tage",{"$f":"COUNTIF(T$8:T$38,\"F\")","v":10},null,null,{"$f":"\"Saldo \"&IF(Zeitmodell=\"Vollzeit\",\"1:1,5\",\"1:1,25\")& \" (~15min) > \"","v":"Saldo 1:1,5 (~15min) > "},null,null,null,{"$f":"ROUND($N40*4,0)/4","v":0},null,null,null,null,{"$f":"IF(Zeitmodell=\"Vollzeit\",$N39*1.5,$N39*1.25)","v":0},{"$f":"IF(Zeitmodell=\"Vollzeit\",\" < 1:1,5 \",\" < 1:1,25 \")&$Q40","v":" < 1:1,5 Stunden berechnen"},null,"Stunden berechnen"]
["ZK-Tage",0,null,null,"Saldo 1:2 (~15min) > ",null,null,null,{"$f":"ROUND($N41*4,0)/4","v":0},null,null,null,null,{"$f":"K39*2","v":0}," < 1:2    Stunden berechnen"]
["ZA-Tage",{"$f":"COUNTIF(D$8:D$38,\"Z\")","v":0},null,null," Saldo Vormonat > ",null,null,null,{"$f":"$J5","v":0},null,null,null,null,null,null,null,"Gültigkeit ausbezahlt"]
["Urlaubstage",{"$f":"COUNTIF(D$8:D$38,\"U\")","v":0},null,null," Saldo Gesamt > ",null,null,null,{"$f":"SUM(I39:I42)","v":0},null,{"$f":"IF($I$43>=$R$2,\"< Hier ausbezahlte Std. eingeben. (Die Eingabe ist hier erst ab   < einem Saldo von \"&TEXT($R$2,\"#.##0,00\")&\" Std., und nur in 0,25-Schritten möglich.)\",\"\")","v":""},null,null,null,null,null,{"$f":"IF(AND($J$43<>\"\",NOT(ISNUMBER($J$43))),FALSE,OR(AND($J$43>=0,$J$43<=$I$43,MOD($J$43,0.25)=0),$J$43=\"\"))","v":true}]
["Krank",{"$f":"COUNTIF(D$8:D$38,\"K\")","v":0},null,null," Saldo Übertrag > ",null,null,null,{"$f":"$I43-$J43","v":0},{"$f":"\" < Dieser Stunden-Saldo wird in das nächste \"&IF($Q$3=\"Dezember\",\"Jahr\",\"Monat\")&\" übertragen\"","v":" < Dieser Stunden-Saldo wird in das nächste Monat übertragen"}]
[null,null,null,"Z"]
[]
[]
[{"$f":"\"Unterschrift von \"&Vorgesetzter","v":"Unterschrift von Vorname Nachname"},null,null,null,null,null,null,null,null,null,null,{"$f":"\"Unterschrift von \"&Name","v":"Unterschrift von Vorname Nachname"}]

{"sheet":"November","index":11,"n_rows":48,"n_cols":60,"rows_kept":48,"cut":false,"hidden":true,"merged":[[47,0,47,3],[47,11,47,15],[42,4,42,7],[42,10,42,15],[43,4,43,7],[44,4,44,7],[45,4,45,7],[46,4,46,7],[38,2,43,3],[38,4,38,7],[38,11,38,12],[38,14,38,15],[39,4,39,7],[39,14,39,15],[40,4,40,7],[40,14,40,15],[41,4,41,7],[41,10,41,15],[5,7,6,7],[5,10,6,10],[5,11,6,11],[5,12,6,12],[5,13,6,13],[5,27,5,32],[4,2,4,3],[4,4,4,5],[5,2,6,2],[5,3,6,3],[5,5,6,5],[5,6,6,6],[0,15,1,15],[1,5,1,7],[2,5,2,7],[3,0,3,3],[3,4,3,5],[3,6,4,8],[3,14,6,14],[3,15,6,15],[4,0,6,0],[4,1,6,1]]}
[" BOKU-Zeiterfassung für Allgemeines Personal",null,null,null,null,null,null,null,null,null,null,null,null,null,null,null,"Monat","Stunden-Saldo Grenzen","Status Blatteingabe"]
[{"$f":"\" Org.-Einh. : \"&OrgEinheit","v":" Org.-Einh. : HXXXXX"},null,null,null,null,"Zeitmodell:",null,null,{"$f":"\" \"&Zeitmodell","v":" Vollzeit"},"Modus:",{"$f":"\" \"&Zeitmodus","v":" Gleitzeit"},null,null,null,null,null,{"$f":"IF(ISNA($Q$4),1,$Q$4)","v":11},{"$f":"IF($Q$2=12,NormalOGDez,NormalOG)","v":71.999999999999986},{"$f":"SUM($BH8:$BH38)","v":0}]
[{"$f":" \" Mitarbeiter/in: \"&Name","v":" Mitarbeiter/in: Vorname Nachname"},null,null,null,null,"Vorgesetzte/r:",null,null,{"$f":"\" \"&Vorgesetzter","v":" Vorname Nachname"},null,null,null,null,null,null,null,{"$f":"RIGHT(CELL(\"filename\",A1),LEN(CELL(\"filename\",A1))-SEARCH(\"]\",CELL(\"filename\",A1),1))","v":"November"},{"$f":"IF($Q$2=12,NormalUGDez,NormalUG)","v":-24},{"$f":"IF($Q$2=1,$S$2,$S$2+INDIRECT($S$5))","v":0}]
[{"$f":" \" Monat: \"&$Q$3&\" \"&Jahr","v":" Monat: November 2023"},null,null,null,"Dienstplan",null,"Normalstunden Feiertag-ÜS1:2",null,null,"Übertrag","Überstundenberechnung",null,null,null," Unterschrift des\n Vorgesetzten","Anmerkungen \n(z.B. Überstunden- notwendigkeit)",{"$f":"IF(ISNA(VLOOKUP($Q$3,MTab,2,FALSE)),1,VLOOKUP($Q$3,MTab,2,FALSE))","v":11},null,"Übertrags Adresse Blatteingabe"]
[" Datum","Wochentag","Tagesinformationen",null,{"$f":"\"Wochen-AZ\"&\" \"&TEXT(WAZ,\"[hh]:mm\")","v":"Wochen-AZ 40:00"},null,null,null,null,{"$f":"IF(ISNA($Q$5),Übertrag,INDIRECT($Q$5))","v":0},"ÜS1:2",{"$f":"IF(Zeitmodell=\"Vollzeit\",\" Überstunden1:1,5\",\" Überstunden1:1,25\")","v":" Überstunden1:1,5"},null,null,null,null,{"$f":"IF(ISNA(VLOOKUP($Q$3,MTab,3,FALSE)),\"Übertrag\",VLOOKUP($Q$3,MTab,3,FALSE))","v":"Oktober!$I$44"},null,{"$f":"IF(ISNA(VLOOKUP($Q$3,MTab,4,FALSE)),$Q$3&\"!$S$2\",VLOOKUP($Q$3,MTab,4,FALSE))","v":"Oktober!$S$3"}]
[null,null," Feiertage\n Wochenende\n Urlaub, ZA, Krank","[U]rlaub\n[Z]A\n[ZK]\n[K]rank","Normal-","Soll","Von","Bis","Plus","Saldo","Plus","Von","Bis","Plus",null,null,"Hintergrundberechnungen",null,null,null,null,null,null,"Saldo aktuell",null,null,null,"GAZ-Tabellenabbildung",null,null,null,null,null,"Eingabebeprüfungen"]
[null,null,null,null,"Arbeitszeit",null,null,null,"Minus","akuell",null,null,null,null,null,null,"Datum","Monat OK","Abwesenh.","Freie Tage","ÜA-Tage","Std.","Soll-Std.",{"$f":"IF(ISNA($Q$5),Übertrag,INDIRECT($Q$5))","v":0},"Std.-Soll = 0","Std.-Soll > 0","Std.-Soll < 0",{"$f":"I_GAZGRVon","v":2},{"$f":"I_GAZNAZVon","v":3},{"$f":"I_GAZKVon","v":4},{"$f":"I_GAZKBis","v":6},{"$f":"I_GAZNAZBis","v":7},{"$f":"I_GAZGRBis","v":8},"Zeiteingabe","UZK-Eing.\nerlaubt","UZK-Eing.\ngültig","Normalst. ein erlaubt","Überstd. ein erlaubt","Normalstd.\neingegeben","Überstd.\neingegeben","Normal VON möglich OG","Normal VON möglich UG","Normal BIS möglich OG","Normal BIS möglich UG","Normal VON\n15min","Normal VON richtig","Normal BIS\n15min","Normal BIS richtig","ZA-Kern Von","ZA-Kern Bis","ZA-Kern","Über VON Obergrenze","Über VON Untergrenze","Über BIS Obergrenze","Über BIS Untergrenze","Über VON\n15min","Über VON richtig","Überl BIS\n15min","Über BIS richtig","Status Zeilen Eingabe"]
[{"$f":"IF($R8,$Q8,\"\")","v":"2023-11-01"},{"$f":"IF($R8,VLOOKUP(WEEKDAY($Q8,2),WOTA,2,FALSE),\"\")","v":"Mi"},{"$f":"IF($R8,\" \"&IF($S8=\"\",VLOOKUP($Q8,FListe,3,FALSE),$S8),\"\")","v":" Allerheiligen"},null,{"$f":"IF(AND($R8,$T8<>\"F\"),IF($AC8=$AF8,\"keine NAZ\",TEXT($AC8,\"hh:mm\")&\"-\"&TEXT($AF8,\"hh:mm\")),\"\")","v":""},{"$f":"IF($R8,IF($T8=\"F\",0,VLOOKUP($B8,GAZ,I_GAZNAZ,FALSE)),\"\")","v":"00:00:00"},null,null,{"$f":"IF(Zeitmodus=\"Gleitzeit\",IF($U8=\"F\",\"\",IF(AND($R8,$AM8,NOT($Y8)),ROUND(($V8-$F8)*24,2),IF($D8=\"Z\",$F8*-24,\"\"))),IF(OR($D8=\"Z\",AND($AM8,$U8=\"A\",W8<0)),ROUND($W8*24,2),\"\"))","v":""},{"$f":"IF($R8,$X8,\"\")","v":0},{"$f":"IF(AND($U8=\"F\",$AM8),ROUND($V8*24,2),\"\")","v":""},null,null,{"$f":"IF(Zeitmodus=\"Gleitzeit\",IF(AND($R8,$AN8,$M8-$L8<>0,$AL8),ROUND(($M8-$L8)*24,2),\"\"),IF(AND($AM8,$U8=\"A\",W8>0),ROUND(W8*24,2),\"\"))","v":""},null,null,{"$f":"DATE(Jahr,$Q2,1)","v":"2023-11-01"},{"$f":"$Q$2=MONTH($Q8)","v":true},{"$f":"IF(OR($D8=\"U\",$D8=\"Z\",$D8=\"ZK\",$D8=\"K\"),VLOOKUP($D8,UZK,2,FALSE),\"\")","v":""},{"$f":"IF($R8,VLOOKUP($Q8,FListe,4,FALSE),\"\")","v":"F"},{"$f":"IF($R8,VLOOKUP($Q8,FListe,5,FALSE),\"\")","v":"F"},{"$f":"$H8-$G8","v":0},{"$f":"IF($R8,ROUND($V8-$F8,15),\"\")","v":0},{"$f":"IF($I8<>\"\",$X7+$I8,$X7)","v":0},{"$f":"($W8=0)","v":true},{"$f":"($W8>0)","v":false},{"$f":"($W8<0)","v":false},{"$f":"IF(ISNA(VLOOKUP($B8,GAZ,AB$7,FALSE)),\"\",VLOOKUP($B8,GAZ,AB$7,FALSE))","v":"07:00:00"},"08:00:00",{"$f":"IF(ISNA(VLOOKUP($B8,GAZ,AD$7,FALSE)),\"\",IF($AC8=$AF8,$G8,VLOOKUP($B8,GAZ,AD$7,FALSE)))","v":"09:00:00"},{"$f":"IF(ISNA(VLOOKUP($B8,GAZ,AE$7,FALSE)),\"\",IF($AC8=$AF8,$H8,VLOOKUP($B8,GAZ,AE$7,FALSE)))","v":"14:00:00"},"16:00:00","18:00:00",{"$f":"OR($G8<>\"\",$H8<>\"\",$L8<>\"\",$M8<>\"\")","v":false},{"$f":"AND($T8<>\"F\",NOT($AH8),NOT($AC8=$AF8))","v":false},{"$f":"AND($AI8,OR($D8=\"U\",$D8=\"Z\",$D8=\"K\"))","v":false},{"$f":"AND($D8<>\"U\",$D8<>\"Z\",$D8<>\"K\",$R8)","v":true},{"$f":"AND(Zeitmodus=C_Gleitzeit,$U8<>\"F\",OR($B8=\"Sa\",AND($AM8,$I8>=0,NOT($AY8))))","v":false},{"$f":"AND($G8<>\"\",$H8<>\"\")","v":false},{"$f":"OR($K8<>\"\",AND($L8<>\"\",$M8<>\"\"))","v":false},{"$f":"IF($AK8,TagUG,\"\")","v":"00:00:00"},{"$f":"IF($AK8,IF($H8=\"\",IF(AND($L8<>\"\",$L8<$AG8),$L8,IF(AND($M8<>\"\",$M8<$AG8),$M8,TagOG)),$H8),\"\")","v":"23:59:00"},{"$f":"IF($AK8,IF($G8=\"\",$AB8,$G8),\"\")","v":"07:00:00"},{"$f":"IF($AK8,IF(AND($L8<>\"\",$L8<$AG8),$L8,IF(AND($M8<>\"\",$M8<$AG8),$M8,TagOG)),\"\")","v":"23:59:00"},{"$f":"MOD($G8*24,0.25)=0","v":true},{"$f":"AND($AK8,ISNUMBER($G8),$G8>=$AO8,$G8<=$AP8)","v":false},{"$f":"MOD($H8*24,0.25)=0","v":true},{"$f":"AND($AK8,ISNUMBER($H8),$H8>=$AQ8,$H8<=$AR8)","v":false},{"$f":"AND(Zeitmodus=C_Gleitzeit,$B8<>\"Sa\",$G8<>\"\",$G8>$AD8)","v":false},{"$f":"AND(Zeitmodus=C_Gleitzeit,$B8<>\"Sa\",$H8<>\"\",$H8<$AE8)","v":false},{"$f":"AND($U8<>\"F\",OR($AW8,$AX8))","v":false},{"$f":"IF($B8=\"Sa\",IF($H8<>\"\",$H8,TIME(0,0,0)),IF($AL8,IF(AND($H8<>\"\",$H8>$AF8),$H8,$AF8),\"\"))","v":""},{"$f":"IF($AL8,IF($M8<>\"\",$M8,$BC8),\"\")","v":""},{"$f":"IF($B8=\"Sa\",IF($L8=\"\",TIME(0,0,0),$L8),IF($AL8,IF($L8<>\"\",$L8,IF(AND($H8<>\"\",$H8>$AF8),$H8,$AF8)),\"\"))","v":""},{"$f":"IF($AL8,TIME(23,59,0),\"\")","v":""},{"$f":"MOD($L8*24,0.25)=0","v":true},{"$f":"AND($AL8,ISNUMBER($L8),$L8>=$AZ8,$BA8>=$L8)","v":false},{"$f":"MOD($M8*24,0.25)=0","v":true},{"$f":"AND($AL8,ISNUMBER($M8),$M8>=$BB8,$M8<=$BC8)","v":false},{"$f":"IF(AND(ISBLANK($D8),ISBLANK($G8),ISBLANK($H8),ISBLANK($L8),ISBLANK($M8),ISBLANK($P8)),0,1)","v":0}]
[{"$f":"IF($R9,$Q9,\"\")","v":"2023-11-02"},"Do"," Allerseelen",null,{"$f":"IF(AND($R9,$T9<>\"F\"),IF($AC9=$AF9,\"keine NAZ\",TEXT($AC9,\"hh:mm\")&\"-\"&TEXT($AF9,\"hh:mm\")),\"\")","v":"08:00-16:00"},"08:00:00",null,null,"",0,{"$f":"IF(AND($U9=\"F\",$AM9),ROUND($V9*24,2),\"\")","v":""},null,null,"",null,null,{"$f":" Q8+1","v":"2023-11-02"},true,"","A","A",0,-0.33333333333333298,0,false,false,true,"07:00:00","08:00:00","09:00:00","14:00:00","16:00:00","18:00:00",false,{"$f":"AND($T9<>\"F\",NOT($AH9),NOT($AC9=$AF9))","v":true},false,true,{"$f":"AND(Zeitmodus=C_Gleitzeit,$U9<>\"F\",OR($B9=\"Sa\",AND($AM9,$I9>=0,NOT($AY9))))","v":false},false,{"$f":"OR($K9<>\"\",AND($L9<>\"\",$M9<>\"\"))","v":false},"00:00:00","23:59:00",{"$f":"IF($AK9,IF($G9=\"\",TagUG,$G9),\"\")","v":"00:00:00"},"23:59:00",true,false,true,false,false,false,{"$f":"AND($U9<>\"F\",OR($AW9,$AX9))","v":false},"","","","",true,false,true,false,0]
["2023-11-03","Fr"," ",null,"08:00-16:00","08:00:00",null,null,"",0,"",null,null,"",null,null,"2023-11-03",true,"","A","A",0,-0.33333333333333298,0,false,false,true,"07:00:00","08:00:00","09:00:00","12:00:00","16:00:00","18:00:00",false,true,false,true,false,false,false,"00:00:00","23:59:00","00:00:00","23:59:00",true,false,true,false,false,false,false,"","","","",true,false,true,false,0]
["2023-11-04","Sa"," Wochenende",null,"","00:00:00",null,null,"",0,"",null,null,"",null,null,"2023-11-04",true,"","F","A",0,0,0,true,false,false,"","","","","","",false,false,false,true,true,false,false,"00:00:00","23:59:00","00:00:00","23:59:00",true,false,true,false,false,false,false,"00:00:00","23:59:00","00:00:00","23:59:00",true,false,true,false,0]
["2023-11-05","So"," Wochenende",null,"","00:00:00",null,null,"",0,"",null,null,"",null,null,"2023-11-05",true,"","F","F",0,0,0,true,false,false,"","","","","","",false,false,false,true,false,false,false,"00:00:00","23:59:00","00:00:00","23:59:00",true,false,true,false,false,false,false,"","","","",true,false,true,false,0]
["2023-11-06","Mo"," ",null,"08:00-16:00","08:00:00",null,null,"",0,"",null,null,"",null,null,"2023-11-06",true,"","A","A",0,-0.33333333333333298,0,false,false,true,"07:00:00","08:00:00","09:00:00","14:00:00","16:00:00","18:00:00",false,true,false,true,false,false,false,"00:00:00","23:59:00","00:00:00","23:59:00",true,false,true,false,false,false,false,"","","","",true,false,true,false,0]
["2023-11-07","Di"," ",null,"08:00-16:00","08:00:00",null,null,"",0,"",null,null,"",null,null,"2023-11-07",true,"","A","A",0,-0.33333333333333298,0,false,false,true,"07:00:00","08:00:00","09:00:00","14:00:00","16:00:00","18:00:00",false,true,false,true,false,false,false,"00:00:00","23:59:00","00:00:00","23:59:00",true,false,true,false,false,false,false,"","","","",true,false,true,false,0]
["2023-11-08","Mi"," ",null,"08:00-16:00","08:00:00",null,null,"",0,"",null,null,"",null,null,"2023-11-08",true,"","A","A",0,-0.33333333333333298,0,false,false,true,"07:00:00","08:00:00","09:00:00","14:00:00","16:00:00","18:00:00",false,true,false,true,false,false,false,"00:00:00","23:59:00","00:00:00","23:59:00",true,false,true,false,false,false,false,"","","","",true,false,true,false,0]
["2023-11-09","Do"," ",null,"08:00-16:00","08:00:00",null,null,"",0,"",null,null,"",null,null,"2023-11-09",true,"","A","A",0,-0.33333333333333298,0,false,false,true,"07:00:00","08:00:00","09:00:00","14:00:00","16:00:00","18:00:00",false,true,false,true,false,false,false,"00:00:00","23:59:00","00:00:00","23:59:00",true,false,true,false,false,false,false,"","","","",true,false,true,false,0]
["2023-11-10","Fr"," ",null,"08:00-16:00","08:00:00",null,null,"",0,"",null,null,"",null,null,"2023-11-10",true,"","A","A",0,-0.33333333333333298,0,false,false,true,"07:00:00","08:00:00","09:00:00","12:00:00","16:00:00","18:00:00",false,true,false,true,false,false,false,"00:00:00","23:59:00","00:00:00","23:59:00",true,false,true,false,false,false,false,"","","","",true,false,true,false,0]
["2023-11-11","Sa"," Wochenende",null,"","00:00:00",null,null,"",0,"",null,null,"",null,null,"2023-11-11",true,"","F","A",0,0,0,true,false,false,"","","","","","",false,false,false,true,true,false,false,"00:00:00","23:59:00","00:00:00","23:59:00",true,false,true,false,false,false,false,"00:00:00","23:59:00","00:00:00","23:59:00",true,false,true,false,0]
["2023-11-12","So"," Wochenende",null,"","00:00:00",null,null,"",0,"",null,null,"",null,null,"2023-11-12",true,"","F","F",0,0,0,true,false,false,"","","","","","",false,false,false,true,false,false,false,"00:00:00","23:59:00","00:00:00","23:59:00",true,false,true,false,false,false,false,"","","","",true,false,true,false,0]
["2023-11-13","Mo"," ",null,"08:00-16:00","08:00:00",null,null,"",0,"",null,null,"",null,null,"2023-11-13",true,"","A","A",0,-0.33333333333333298,0,false,false,true,"07:00:00","08:00:00","09:00:00","14:00:00","16:00:00","18:00:00",false,true,false,true,false,false,false,"00:00:00","23:59:00","00:00:00","23:59:00",true,false,true,false,false,false,false,"","","","",true,false,true,false,0]
["2023-11-14","Di"," ",null,"08:00-16:00","08:00:00",null,null,"",0,"",null,null,"",null,null,"2023-11-14",true,"","A","A",0,-0.33333333333333298,0,false,false,true,"07:00:00","08:00:00","09:00:00","14:00:00","16:00:00","18:00:00",false,true,false,true,false,false,false,"00:00:00","23:59:00","00:00:00","23:59:00",true,false,true,false,false,false,false,"","","","",true,false,true,false,0]
["2023-11-15","Mi"," St. Leopold",null,"08:00-16:00","08:00:00",null,null,"",0,"",null,null,"",null,null,"2023-11-15",true,"","A","A",0,-0.33333333333333298,0,false,false,true,"07:00:00","08:00:00","09:00:00","14:00:00","16:00:00","18:00:00",false,true,false,true,false,false,false,"00:00:00","23:59:00","00:00:00","23:59:00",true,false,true,false,false,false,false,"","","","",true,false,true,false,0]
["2023-11-16","Do"," ",null,"08:00-16:00","08:00:00",null,null,"",0,"",null,null,"",null,null,"2023-11-16",true,"","A","A",0,-0.33333333333333298,0,false,false,true,"07:00:00","08:00:00","09:00:00","14:00:00","16:00:00","18:00:00",false,true,false,true,false,false,false,"00:00:00","23:59:00","00:00:00","23:59:00",true,false,true,false,false,false,false,"","","","",true,false,true,false,0]
["2023-11-17","Fr"," ",null,"08:00-16:00","08:00:00",null,null,"",0,"",null,null,"",null,null,"2023-11-17",true,"","A","A",0,-0.33333333333333298,0,false,false,true,{"$f":"IF(ISNA(VLOOKUP($B24,GAZ,AB$7,FALSE)),\"\",VLOOKUP($B24,GAZ,AB$7,FALSE))","v":"07:00:00"},"08:00:00","09:00:00","12:00:00","16:00:00","18:00:00",false,true,false,true,false,false,false,"00:00:00","23:59:00","00:00:00","23:59:00",true,false,true,false,false,false,false,"","","","",true,false,true,false,0]
["2023-11-18","Sa"," Wochenende",null,"","00:00:00",null,null,"",0,"",null,null,"",null,null,"2023-11-18",true,"","F","A",0,0,0,true,false,false,"","","","","","",false,false,false,true,true,false,false,"00:00:00","23:59:00","00:00:00","23:59:00",true,false,true,false,false,false,false,"00:00:00","23:59:00","00:00:00","23:59:00",true,false,true,false,0]
["2023-11-19","So"," Wochenende",null,"","00:00:00",null,null,"",0,"",null,null,"",null,null,"2023-11-19",true,"","F","F",0,0,0,true,false,false,"","","","","","",false,false,false,true,false,false,false,"00:00:00","23:59:00","00:00:00","23:59:00",true,false,true,false,false,false,false,"","","","",true,false,true,false,0]
["2023-11-20","Mo"," ",null,"08:00-16:00","08:00:00",null,null,"",0,"",null,null,"",null,null,"2023-11-20",true,"","A","A",0,-0.33333333333333298,0,false,false,true,"07:00:00","08:00:00","09:00:00","14:00:00","16:00:00","18:00:00",false,true,false,true,false,false,false,"00:00:00","23:59:00","00:00:00","23:59:00",true,false,true,false,false,false,false,"","","","",true,false,true,false,0]
["2023-11-21","Di"," ",null,"08:00-16:00","08:00:00",null,null,"",0,"",null,null,"",null,null,"2023-11-21",true,"","A","A",0,-0.33333333333333298,0,false,false,true,"07:00:00","08:00:00","09:00:00","14:00:00","16:00:00","18:00:00",false,true,false,true,false,false,false,"00:00:00","23:59:00","00:00:00","23:59:00",true,false,true,false,false,false,false,"","","","",true,false,true,false,0]
["2023-11-22","Mi"," ",null,"08:00-16:00","08:00:00",null,null,"",0,"",null,null,"",null,null,"2023-11-22",true,"","A","A",0,-0.33333333333333298,0,false,false,true,"07:00:00","08:00:00","09:00:00","14:00:00","16:00:00","18:00:00",false,true,false,true,false,false,false,"00:00:00","23:59:00","00:00:00","23:59:00",true,false,true,false,false,false,false,"","","","",true,false,true,false,0]
["2023-11-23","Do"," ",null,"08:00-16:00","08:00:00",null,null,"",0,"",null,null,"",null,null,"2023-11-23",true,"","A","A",0,-0.33333333333333298,0,false,false,true,"07:00:00","08:00:00","09:00:00","14:00:00","16:00:00","18:00:00",false,true,false,true,false,false,false,"00:00:00","23:59:00","00:00:00","23:59:00",true,false,true,false,false,false,false,"","","","",true,false,true,false,0]
["2023-11-24","Fr"," ",null,"08:00-16:00","08:00:00",null,null,"",0,"",null,null,"",null,null,"2023-11-24",true,"","A","A",0,-0.33333333333333298,0,false,false,true,"07:00:00","08:00:00","09:00:00","12:00:00","16:00:00","18:00:00",false,true,false,true,false,false,false,"00:00:00","23:59:00","00:00:00","23:59:00",true,false,true,false,false,false,false,"","","","",true,false,true,false,0]
["2023-11-25","Sa"," Wochenende",null,"","00:00:00",null,null,"",0,"",null,null,"",null,null,"2023-11-25",true,"","F","A",0,0,0,true,false,false,"","","","","","",false,false,false,true,true,false,false,"00:00:00","23:59:00","00:00:00","23:59:00",true,false,true,false,false,false,false,"00:00:00","23:59:00","00:00:00","23:59:00",true,false,true,false,0]
["2023-11-26","So"," Wochenende",null,"","00:00:00",null,null,"",0,"",null,null,"",null,null,"2023-11-26",true,"","F","F",0,0,0,true,false,false,"","","","","","",false,false,false,true,false,false,false,"00:00:00","23:59:00","00:00:00","23:59:00",true,false,true,false,false,false,false,"","","","",true,false,true,false,0]
["2023-11-27","Mo"," ",null,"08:00-16:00","08:00:00",null,null,"",0,"",null,null,"",null,null,"2023-11-27",true,"","A","A",0,-0.33333333333333298,0,false,false,true,"07:00:00","08:00:00","09:00:00","14:00:00","16:00:00","18:00:00",false,true,false,true,false,false,false,"00:00:00","23:59:00","00:00:00","23:59:00",true,false,true,false,false,false,false,"","","","",true,false,true,false,0]
["2023-11-28","Di"," ",null,"08:00-16:00","08:00:00",null,null,"",0,"",null,null,"",null,null,"2023-11-28",true,"","A","A",0,-0.33333333333333298,0,false,false,true,"07:00:00","08:00:00","09:00:00","14:00:00","16:00:00","18:00:00",false,true,false,true,false,false,false,"00:00:00","23:59:00","00:00:00","23:59:00",true,false,true,false,false,false,false,"","","","",true,false,true,false,0]
["2023-11-29","Mi"," ",null,"08:00-16:00","08:00:00",null,null,"",0,"",null,null,"",null,null,"2023-11-29",true,"","A","A",0,-0.33333333333333298,0,false,false,true,"07:00:00","08:00:00","09:00:00","14:00:00","16:00:00","18:00:00",false,true,false,true,false,false,false,"00:00:00","23:59:00","00:00:00","23:59:00",true,false,true,false,false,false,false,"","","","",true,false,true,false,0]
["2023-11-30","Do"," ",null,"08:00-16:00","08:00:00",null,null,"",0,"",null,null,"",null,null,"2023-11-30",true,"","A","A",0,-0.33333333333333298,0,false,false,true,"07:00:00","08:00:00","09:00:00","14:00:00","16:00:00","18:00:00",false,true,false,true,false,false,false,"00:00:00","23:59:00","00:00:00","23:59:00",true,false,true,false,false,false,false,"","","","",true,false,true,false,0]
["","","",null,"","",null,null,"",{"$f":"IF($R38,$X38,\"\")","v":""},"",null,null,"",null,null,"2023-12-01",false,"","","",0,"",0,false,true,false,"","","","","","",false,false,false,false,false,false,false,"","","","",true,false,true,false,false,false,false,"","","","",true,false,true,false,0]
["Arbeitstage",{"$f":"COUNTIF(T$8:T$38,\"A\")","v":21},null,null,{"$f":"\"Saldo Monat (~15min) > \"","v":"Saldo Monat (~15min) > "},null,null,null,{"$f":"ROUND(SUM(I8:I38)*4,0)/4","v":0},null,{"$f":"SUM(K8:K38)","v":0}," < ÜS1:2",null,{"$f":"SUM(N8:N38)","v":0},{"$f":"IF(Zeitmodell=\"Vollzeit\",\" < ÜS1:1,5 \",\" < ÜS1:1,25 \")&Zeitmodell","v":" < ÜS1:1,5 Vollzeit"},null,"Zeitmodell Text"]
["Freie Tage",{"$f":"COUNTIF(T$8:T$38,\"F\")","v":9},null,null,{"$f":"\"Saldo \"&IF(Zeitmodell=\"Vollzeit\",\"1:1,5\",\"1:1,25\")& \" (~15min) > \"","v":"Saldo 1:1,5 (~15min) > "},null,null,null,{"$f":"ROUND($N40*4,0)/4","v":0},null,null,null,null,{"$f":"IF(Zeitmodell=\"Vollzeit\",$N39*1.5,$N39*1.25)","v":0},{"$f":"IF(Zeitmodell=\"Vollzeit\",\" < 1:1,5 \",\" < 1:1,25 \")&$Q40","v":" < 1:1,5 Stunden berechnen"},null,"Stunden berechnen"]
["ZK-Tage",0,null,null,"Saldo 1:2 (~15min) > ",null,null,null,{"$f":"ROUND($N41*4,0)/4","v":0},null,null,null,null,{"$f":"K39*2","v":0}," < 1:2    Stunden berechnen"]
["ZA-Tage",{"$f":"COUNTIF(D$8:D$38,\"Z\")","v":0},null,null," Saldo Vormonat > ",null,null,null,{"$f":"$J5","v":0},null,null,null,null,null,null,null,"Gültigkeit ausbezahlt"]
["Urlaubstage",{"$f":"COUNTIF(D$8:D$38,\"U\")","v":0},null,null," Saldo Gesamt > ",null,null,null,{"$f":"SUM(I39:I42)","v":0},null,{"$f":"IF($I$43>=$R$2,\"< Hier ausbezahlte Std. eingeben. (Die Eingabe ist hier erst ab   < einem Saldo von \"&TEXT($R$2,\"#.##0,00\")&\" Std., und nur in 0,25-Schritten möglich.)\",\"\")","v":""},null,null,null,null,null,{"$f":"IF(AND($J$43<>\"\",NOT(ISNUMBER($J$43))),FALSE,OR(AND($J$43>=0,$J$43<=$I$43,MOD($J$43,0.25)=0),$J$43=\"\"))","v":true}]
["Krank",{"$f":"COUNTIF(D$8:D$38,\"K\")","v":0},null,null," Saldo Übertrag > ",null,null,null,{"$f":"$I43-$J43","v":0},{"$f":"\" < Dieser Stunden-Saldo wird in das nächste \"&IF($Q$3=\"Dezember\",\"Jahr\",\"Monat\")&\" übertragen\"","v":" < Dieser Stunden-Saldo wird in das nächste Monat übertragen"}]
[null,null,null,"Z"]
[]
[]
[{"$f":"\"Unterschrift von \"&Vorgesetzter","v":"Unterschrift von Vorname Nachname"},null,null,null,null,null,null,null,null,null,null,{"$f":"\"Unterschrift von \"&Name","v":"Unterschrift von Vorname Nachname"}]

{"sheet":"Dezember","index":12,"n_rows":48,"n_cols":60,"rows_kept":48,"cut":false,"hidden":true,"merged":[[47,0,47,3],[47,11,47,15],[42,4,42,7],[42,10,42,15],[43,4,43,7],[44,4,44,7],[45,4,45,7],[46,4,46,7],[38,2,43,3],[38,4,38,7],[38,11,38,12],[38,14,38,15],[39,4,39,7],[39,14,39,15],[40,4,40,7],[40,14,40,15],[41,4,41,7],[41,10,41,15],[5,7,6,7],[5,10,6,10],[5,11,6,11],[5,12,6,12],[5,13,6,13],[5,27,5,32],[4,2,4,3],[4,4,4,5],[5,2,6,2],[5,3,6,3],[5,5,6,5],[5,6,6,6],[0,15,1,15],[1,5,1,7],[2,5,2,7],[3,0,3,3],[3,4,3,5],[3,6,4,8],[3,14,6,14],[3,15,6,15],[4,0,6,0],[4,1,6,1]]}
[" BOKU-Zeiterfassung für Allgemeines Personal",null,null,null,null,null,null,null,null,null,null,null,null,null,null,null,"Monat","Stunden-Saldo Grenzen","Status Blatteingabe"]
[{"$f":"\" Org.-Einh. : \"&OrgEinheit","v":" Org.-Einh. : HXXXXX"},null,null,null,null,"Zeitmodell:",null,null,{"$f":"\" \"&Zeitmodell","v":" Vollzeit"},"Modus:",{"$f":"\" \"&Zeitmodus","v":" Gleitzeit"},null,null,null,null,null,{"$f":"IF(ISNA($Q$4),1,$Q$4)","v":12},{"$f":"IF($Q$2=12,NormalOGDez,NormalOG)","v":24},{"$f":"SUM($BH8:$BH38)","v":0}]
[{"$f":" \" Mitarbeiter/in: \"&Name","v":" Mitarbeiter/in: Vorname Nachname"},null,null,null,null,"Vorgesetzte/r:",null,null,{"$f":"\" \"&Vorgesetzter","v":" Vorname Nachname"},null,null,null,null,null,null,null,{"$f":"RIGHT(CELL(\"filename\",A1),LEN(CELL(\"filename\",A1))-SEARCH(\"]\",CELL(\"filename\",A1),1))","v":"Dezember"},{"$f":"IF($Q$2=12,NormalUGDez,NormalUG)","v":-8},{"$f":"IF($Q$2=1,$S$2,$S$2+INDIRECT($S$5))","v":0}]
[{"$f":" \" Monat: \"&$Q$3&\" \"&Jahr","v":" Monat: Dezember 2023"},null,null,null,"Dienstplan",null,"Normalstunden Feiertag-ÜS1:2",null,null,"Übertrag","Überstundenberechnung",null,null,null," Unterschrift des\n Vorgesetzten","Anmerkungen \n(z.B. Überstunden- notwendigkeit)",{"$f":"IF(ISNA(VLOOKUP($Q$3,MTab,2,FALSE)),1,VLOOKUP($Q$3,MTab,2,FALSE))","v":12},null,"Übertrags Adresse Blatteingabe"]
[" Datum","Wochentag","Tagesinformationen",null,{"$f":"\"Wochen-AZ\"&\" \"&TEXT(WAZ,\"[hh]:mm\")","v":"Wochen-AZ 40:00"},null,null,null,null,{"$f":"IF(ISNA($Q$5),Übertrag,INDIRECT($Q$5))","v":0},"ÜS1:2",{"$f":"IF(Zeitmodell=\"Vollzeit\",\" Überstunden1:1,5\",\" Überstunden1:1,25\")","v":" Überstunden1:1,5"},null,null,null,null,{"$f":"IF(ISNA(VLOOKUP($Q$3,MTab,3,FALSE)),\"Übertrag\",VLOOKUP($Q$3,MTab,3,FALSE))","v":"November!$I$44"},null,{"$f":"IF(ISNA(VLOOKUP($Q$3,MTab,4,FALSE)),$Q$3&\"!$S$2\",VLOOKUP($Q$3,MTab,4,FALSE))","v":"November!$S$3"}]
[null,null," Feiertage\n Wochenende\n Urlaub, ZA, Krank","[U]rlaub\n[Z]A\n[ZK]\n[K]rank","Normal-","Soll","Von","Bis","Plus","Saldo","Plus","Von","Bis","Plus",null,null,"Hintergrundberechnungen",null,null,null,null,null,null,"Saldo aktuell",null,null,null,"GAZ-Tabellenabbildung",null,null,null,null,null,"Eingabebeprüfungen"]
[null,null,null,null,"Arbeitszeit",null,null,null,"Minus","akuell",null,null,null,null,null,null,"Datum","Monat OK","Abwesenh.","Freie Tage","ÜA-Tage","Std.","Soll-Std.",{"$f":"IF(ISNA($Q$5),Übertrag,INDIRECT($Q$5))","v":0},"Std.-Soll = 0","Std.-Soll > 0","Std.-Soll < 0",{"$f":"I_GAZGRVon","v":2},{"$f":"I_GAZNAZVon","v":3},{"$f":"I_GAZKVon","v":4},{"$f":"I_GAZKBis","v":6},{"$f":"I_GAZNAZBis","v":7},{"$f":"I_GAZGRBis","v":8},"Zeiteingabe","UZK-Eing.\nerlaubt","UZK-Eing.\ngültig","Normalst. ein erlaubt","Überstd. ein erlaubt","Normalstd.\neingegeben","Überstd.\neingegeben","Normal VON möglich OG","Normal VON möglich UG","Normal BIS möglich OG","Normal BIS möglich UG","Normal VON\n15min","Normal VON richtig","Normal BIS\n15min","Normal BIS richtig","ZA-Kern Von","ZA-Kern Bis","ZA-Kern","Über VON Obergrenze","Über VON Untergrenze","Über BIS Obergrenze","Über BIS Untergrenze","Über VON\n15min","Über VON richtig","Überl BIS\n15min","Über BIS richtig","Status Zeilen Eingabe"]
[{"$f":"IF($R8,$Q8,\"\")","v":"2023-12-01"},{"$f":"IF($R8,VLOOKUP(WEEKDAY($Q8,2),WOTA,2,FALSE),\"\")","v":"Fr"},{"$f":"IF($R8,\" \"&IF($S8=\"\",VLOOKUP($Q8,FListe,3,FALSE),$S8),\"\")","v":" "},null,{"$f":"IF(AND($R8,$T8<>\"F\"),IF($AC8=$AF8,\"keine NAZ\",TEXT($AC8,\"hh:mm\")&\"-\"&TEXT($AF8,\"hh:mm\")),\"\")","v":"08:00-16:00"},{"$f":"IF($R8,IF($T8=\"F\",0,VLOOKUP($B8,GAZ,I_GAZNAZ,FALSE)),\"\")","v":"08:00:00"},null,null,{"$f":"IF(Zeitmodus=\"Gleitzeit\",IF($U8=\"F\",\"\",IF(AND($R8,$AM8,NOT($Y8)),ROUND(($V8-$F8)*24,2),IF($D8=\"Z\",$F8*-24,\"\"))),IF(OR($D8=\"Z\",AND($AM8,$U8=\"A\",W8<0)),ROUND($W8*24,2),\"\"))","v":""},{"$f":"IF($R8,$X8,\"\")","v":0},{"$f":"IF(AND($U8=\"F\",$AM8),ROUND($V8*24,2),\"\")","v":""},null,null,{"$f":"IF(Zeitmodus=\"Gleitzeit\",IF(AND($R8,$AN8,$M8-$L8<>0,$AL8),ROUND(($M8-$L8)*24,2),\"\"),IF(AND($AM8,$U8=\"A\",W8>0),ROUND(W8*24,2),\"\"))","v":""},null,null,{"$f":"DATE(Jahr,$Q2,1)","v":"2023-12-01"},{"$f":"$Q$2=MONTH($Q8)","v":true},{"$f":"IF(OR($D8=\"U\",$D8=\"Z\",$D8=\"ZK\",$D8=\"K\"),VLOOKUP($D8,UZK,2,FALSE),\"\")","v":""},{"$f":"IF($R8,VLOOKUP($Q8,FListe,4,FALSE),\"\")","v":"A"},{"$f":"IF($R8,VLOOKUP($Q8,FListe,5,FALSE),\"\")","v":"A"},{"$f":"$H8-$G8","v":0},{"$f":"IF($R8,ROUND($V8-$F8,15),\"\")","v":-0.33333333333333298},{"$f":"IF($I8<>\"\",$X7+$I8,$X7)","v":0},{"$f":"($W8=0)","v":false},{"$f":"($W8>0)","v":false},{"$f":"($W8<0)","v":true},{"$f":"IF(ISNA(VLOOKUP($B8,GAZ,AB$7,FALSE)),\"\",VLOOKUP($B8,GAZ,AB$7,FALSE))","v":"07:00:00"},"08:00:00",{"$f":"IF(ISNA(VLOOKUP($B8,GAZ,AD$7,FALSE)),\"\",IF($AC8=$AF8,$G8,VLOOKUP($B8,GAZ,AD$7,FALSE)))","v":"09:00:00"},{"$f":"IF(ISNA(VLOOKUP($B8,GAZ,AE$7,FALSE)),\"\",IF($AC8=$AF8,$H8,VLOOKUP($B8,GAZ,AE$7,FALSE)))","v":"12:00:00"},"16:00:00","18:00:00",{"$f":"OR($G8<>\"\",$H8<>\"\",$L8<>\"\",$M8<>\"\")","v":false},{"$f":"AND($T8<>\"F\",NOT($AH8),NOT($AC8=$AF8))","v":true},{"$f":"AND($AI8,OR($D8=\"U\",$D8=\"Z\",$D8=\"K\"))","v":false},{"$f":"AND($D8<>\"U\",$D8<>\"Z\",$D8<>\"K\",$R8)","v":true},{"$f":"AND(Zeitmodus=C_Gleitzeit,$U8<>\"F\",OR($B8=\"Sa\",AND($AM8,$I8>=0,NOT($AY8))))","v":false},{"$f":"AND($G8<>\"\",$H8<>\"\")","v":false},{"$f":"OR($K8<>\"\",AND($L8<>\"\",$M8<>\"\"))","v":false},{"$f":"IF($AK8,TagUG,\"\")","v":"00:00:00"},{"$f":"IF($AK8,IF($H8=\"\",IF(AND($L8<>\"\",$L8<$AG8),$L8,IF(AND($M8<>\"\",$M8<$AG8),$M8,TagOG)),$H8),\"\")","v":"23:59:00"},{"$f":"IF($AK8,IF($G8=\"\",$AB8,$G8),\"\")","v":"07:00:00"},{"$f":"IF($AK8,IF(AND($L8<>\"\",$L8<$AG8),$L8,IF(AND($M8<>\"\",$M8<$AG8),$M8,TagOG)),\"\")","v":"23:59:00"},{"$f":"MOD($G8*24,0.25)=0","v":true},{"$f":"AND($AK8,ISNUMBER($G8),$G8>=$AO8,$G8<=$AP8)","v":false},{"$f":"MOD($H8*24,0.25)=0","v":true},{"$f":"AND($AK8,ISNUMBER($H8),$H8>=$AQ8,$H8<=$AR8)","v":false},{"$f":"AND(Zeitmodus=C_Gleitzeit,$B8<>\"Sa\",$G8<>\"\",$G8>$AD8)","v":false},{"$f":"AND(Zeitmodus=C_Gleitzeit,$B8<>\"Sa\",$H8<>\"\",$H8<$AE8)","v":false},{"$f":"AND($U8<>\"F\",OR($AW8,$AX8))","v":false},{"$f":"IF($B8=\"Sa\",IF($H8<>\"\",$H8,TIME(0,0,0)),IF($AL8,IF(AND($H8<>\"\",$H8>$AF8),$H8,$AF8),\"\"))","v":""},{"$f":"IF($AL8,IF($M8<>\"\",$M8,$BC8),\"\")","v":""},{"$f":"IF($B8=\"Sa\",IF($L8=\"\",TIME(0,0,0),$L8),IF($AL8,IF($L8<>\"\",$L8,IF(AND($H8<>\"\",$H8>$AF8),$H8,$AF8)),\"\"))","v":""},{"$f":"IF($AL8,TIME(23,59,0),\"\")","v":""},{"$f":"MOD($L8*24,0.25)=0","v":true},{"$f":"AND($AL8,ISNUMBER($L8),$L8>=$AZ8,$BA8>=$L8)","v":false},{"$f":"MOD($M8*24,0.25)=0","v":true},{"$f":"AND($AL8,ISNUMBER($M8),$M8>=$BB8,$M8<=$BC8)","v":false},{"$f":"IF(AND(ISBLANK($D8),ISBLANK($G8),ISBLANK($H8),ISBLANK($L8),ISBLANK($M8),ISBLANK($P8)),0,1)","v":0}]
[{"$f":"IF($R9,$Q9,\"\")","v":"2023-12-02"},"Sa"," Wochenende",null,{"$f":"IF(AND($R9,$T9<>\"F\"),IF($AC9=$AF9,\"keine NAZ\",TEXT($AC9,\"hh:mm\")&\"-\"&TEXT($AF9,\"hh:mm\")),\"\")","v":""},"00:00:00",null,null,"",0,{"$f":"IF(AND($U9=\"F\",$AM9),ROUND($V9*24,2),\"\")","v":""},null,null,"",null,null,{"$f":" Q8+1","v":"2023-12-02"},true,"","F","A",0,0,0,true,false,false,"","","","","","",false,{"$f":"AND($T9<>\"F\",NOT($AH9),NOT($AC9=$AF9))","v":false},false,true,{"$f":"AND(Zeitmodus=C_Gleitzeit,$U9<>\"F\",OR($B9=\"Sa\",AND($AM9,$I9>=0,NOT($AY9))))","v":true},false,{"$f":"OR($K9<>\"\",AND($L9<>\"\",$M9<>\"\"))","v":false},"00:00:00","23:59:00",{"$f":"IF($AK9,IF($G9=\"\",TagUG,$G9),\"\")","v":"00:00:00"},"23:59:00",true,false,true,false,false,false,{"$f":"AND($U9<>\"F\",OR($AW9,$AX9))","v":false},"00:00:00","23:59:00","00:00:00","23:59:00",true,false,true,false,0]
["2023-12-03","So"," 1. Advent",null,"","00:00:00",null,null,"",0,"",null,null,"",null,null,"2023-12-03",true,"","F","F",0,0,0,true,false,false,"","","","","","",false,false,false,true,false,false,false,"00:00:00","23:59:00","00:00:00","23:59:00",true,false,true,false,false,false,false,"","","","",true,false,true,false,0]
["2023-12-04","Mo"," ",null,"08:00-16:00","08:00:00",null,null,"",0,"",null,null,"",null,null,"2023-12-04",true,"","A","A",0,-0.33333333333333298,0,false,false,true,"07:00:00","08:00:00","09:00:00","14:00:00","16:00:00","18:00:00",false,true,false,true,false,false,false,"00:00:00","23:59:00","00:00:00","23:59:00",true,false,true,false,false,false,false,"","","","",true,false,true,false,0]
["2023-12-05","Di"," ",null,"08:00-16:00","08:00:00",null,null,"",0,"",null,null,"",null,null,"2023-12-05",true,"","A","A",0,-0.33333333333333298,0,false,false,true,"07:00:00","08:00:00","09:00:00","14:00:00","16:00:00","18:00:00",false,true,false,true,false,false,false,"00:00:00","23:59:00","00:00:00","23:59:00",true,false,true,false,false,false,false,"","","","",true,false,true,false,0]
["2023-12-06","Mi"," St. Nikolaus",null,"08:00-16:00","08:00:00",null,null,"",0,"",null,null,"",null,null,"2023-12-06",true,"","A","A",0,-0.33333333333333298,0,false,false,true,"07:00:00","08:00:00","09:00:00","14:00:00","16:00:00","18:00:00",false,true,false,true,false,false,false,"00:00:00","23:59:00","00:00:00","23:59:00",true,false,true,false,false,false,false,"","","","",true,false,true,false,0]
["2023-12-07","Do"," ",null,"08:00-16:00","08:00:00",null,null,"",0,"",null,null,"",null,null,"2023-12-07",true,"","A","A",0,-0.33333333333333298,0,false,false,true,"07:00:00","08:00:00","09:00:00","14:00:00","16:00:00","18:00:00",false,true,false,true,false,false,false,"00:00:00","23:59:00","00:00:00","23:59:00",true,false,true,false,false,false,false,"","","","",true,false,true,false,0]
["2023-12-08","Fr"," Maria Empfängnis",null,"","00:00:00",null,null,"",0,"",null,null,"",null,null,"2023-12-08",true,"","F","F",0,0,0,true,false,false,"07:00:00","08:00:00","09:00:00","12:00:00","16:00:00","18:00:00",false,false,false,true,false,false,false,"00:00:00","23:59:00","00:00:00","23:59:00",true,false,true,false,false,false,false,"","","","",true,false,true,false,0]
["2023-12-09","Sa"," Wochenende",null,"","00:00:00",null,null,"",0,"",null,null,"",null,null,"2023-12-09",true,"","F","A",0,0,0,true,false,false,"","","","","","",false,false,false,true,true,false,false,"00:00:00","23:59:00","00:00:00","23:59:00",true,false,true,false,false,false,false,"00:00:00","23:59:00","00:00:00","23:59:00",true,false,true,false,0]
["2023-12-10","So"," 2. Advent",null,"","00:00:00",null,null,"",0,"",null,null,"",null,null,"2023-12-10",true,"","F","F",0,0,0,true,false,false,"","","","","","",false,false,false,true,false,false,false,"00:00:00","23:59:00","00:00:00","23:59:00",true,false,true,false,false,false,false,"","","","",true,false,true,false,0]
["2023-12-11","Mo"," ",null,"08:00-16:00","08:00:00",null,null,"",0,"",null,null,"",null,null,"2023-12-11",true,"","A","A",0,-0.33333333333333298,0,false,false,true,"07:00:00","08:00:00","09:00:00","14:00:00","16:00:00","18:00:00",false,true,false,true,false,false,false,"00:00:00","23:59:00","00:00:00","23:59:00",true,false,true,false,false,false,false,"","","","",true,false,true,false,0]
["2023-12-12","Di"," ",null,"08:00-16:00","08:00:00",null,null,"",0,"",null,null,"",null,null,"2023-12-12",true,"","A","A",0,-0.33333333333333298,0,false,false,true,"07:00:00","08:00:00","09:00:00","14:00:00","16:00:00","18:00:00",false,true,false,true,false,false,false,"00:00:00","23:59:00","00:00:00","23:59:00",true,false,true,false,false,false,false,"","","","",true,false,true,false,0]
["2023-12-13","Mi"," ",null,"08:00-16:00","08:00:00",null,null,"",0,"",null,null,"",null,null,"2023-12-13",true,"","A","A",0,-0.33333333333333298,0,false,false,true,"07:00:00","08:00:00","09:00:00","14:00:00","16:00:00","18:00:00",false,true,false,true,false,false,false,"00:00:00","23:59:00","00:00:00","23:59:00",true,false,true,false,false,false,false,"","","","",true,false,true,false,0]
["2023-12-14","Do"," ",null,"08:00-16:00","08:00:00",null,null,"",0,"",null,null,"",null,null,"2023-12-14",true,"","A","A",0,-0.33333333333333298,0,false,false,true,"07:00:00","08:00:00","09:00:00","14:00:00","16:00:00","18:00:00",false,true,false,true,false,false,false,"00:00:00","23:59:00","00:00:00","23:59:00",true,false,true,false,false,false,false,"","","","",true,false,true,false,0]
["2023-12-15","Fr"," ",null,"08:00-16:00","08:00:00",null,null,"",0,"",null,null,"",null,null,"2023-12-15",true,"","A","A",0,-0.33333333333333298,0,false,false,true,"07:00:00","08:00:00","09:00:00","12:00:00","16:00:00","18:00:00",false,true,false,true,false,false,false,"00:00:00","23:59:00","00:00:00","23:59:00",true,false,true,false,false,false,false,"","","","",true,false,true,false,0]
["2023-12-16","Sa"," Wochenende",null,"","00:00:00",null,null,"",0,"",null,null,"",null,null,"2023-12-16",true,"","F","A",0,0,0,true,false,false,"","","","","","",false,false,false,true,true,false,false,"00:00:00","23:59:00","00:00:00","23:59:00",true,false,true,false,false,false,false,"00:00:00","23:59:00","00:00:00","23:59:00",true,false,true,false,0]
["2023-12-17","So"," 3. Advent",null,"","00:00:00",null,null,"",0,"",null,null,"",null,null,"2023-12-17",true,"","F","F",0,0,0,true,false,false,{"$f":"IF(ISNA(VLOOKUP($B24,GAZ,AB$7,FALSE)),\"\",VLOOKUP($B24,GAZ,AB$7,FALSE))","v":""},"","","","","",false,false,false,true,false,false,false,"00:00:00","23:59:00","00:00:00","23:59:00",true,false,true,false,false,false,false,"","","","",true,false,true,false,0]
["2023-12-18","Mo"," ",null,"08:00-16:00","08:00:00",null,null,"",0,"",null,null,"",null,null,"2023-12-18",true,"","A","A",0,-0.33333333333333298,0,false,false,true,"07:00:00","08:00:00","09:00:00","14:00:00","16:00:00","18:00:00",false,true,false,true,false,false,false,"00:00:00","23:59:00","00:00:00","23:59:00",true,false,true,false,false,false,false,"","","","",true,false,true,false,0]
["2023-12-19","Di"," ",null,"08:00-16:00","08:00:00",null,null,"",0,"",null,null,"",null,null,"2023-12-19",true,"","A","A",0,-0.33333333333333298,0,false,false,true,"07:00:00","08:00:00","09:00:00","14:00:00","16:00:00","18:00:00",false,true,false,true,false,false,false,"00:00:00","23:59:00","00:00:00","23:59:00",true,false,true,false,false,false,false,"","","","",true,false,true,false,0]
["2023-12-20","Mi"," ",null,"08:00-16:00","08:00:00",null,null,"",0,"",null,null,"",null,null,"2023-12-20",true,"","A","A",0,-0.33333333333333298,0,false,false,true,"07:00:00","08:00:00","09:00:00","14:00:00","16:00:00","18:00:00",false,true,false,true,false,false,false,"00:00:00","23:59:00","00:00:00","23:59:00",true,false,true,false,false,false,false,"","","","",true,false,true,false,0]
["2023-12-21","Do"," ",null,"08:00-16:00","08:00:00",null,null,"",0,"",null,null,"",null,null,"2023-12-21",true,"","A","A",0,-0.33333333333333298,0,false,false,true,"07:00:00","08:00:00","09:00:00","14:00:00","16:00:00","18:00:00",false,true,false,true,false,false,false,"00:00:00","23:59:00","00:00:00","23:59:00",true,false,true,false,false,false,false,"","","","",true,false,true,false,0]
["2023-12-22","Fr"," ",null,"08:00-16:00","08:00:00",null,null,"",0,"",null,null,"",null,null,"2023-12-22",true,"","A","A",0,-0.33333333333333298,0,false,false,true,"07:00:00","08:00:00","09:00:00","12:00:00","16:00:00","18:00:00",false,true,false,true,false,false,false,"00:00:00","23:59:00","00:00:00","23:59:00",true,false,true,false,false,false,false,"","","","",true,false,true,false,0]
["2023-12-23","Sa"," Wochenende",null,"","00:00:00",null,null,"",0,"",null,null,"",null,null,"2023-12-23",true,"","F","A",0,0,0,true,false,false,"","","","","","",false,false,false,true,true,false,false,"00:00:00","23:59:00","00:00:00","23:59:00",true,false,true,false,false,false,false,"00:00:00","23:59:00","00:00:00","23:59:00",true,false,true,false,0]
["2023-12-24","So"," 4. Advent",null,"","00:00:00",null,null,"",0,"",null,null,"",null,null,"2023-12-24",true,"","F","F",0,0,0,true,false,false,"","","","","","",false,false,false,true,false,false,false,"00:00:00","23:59:00","00:00:00","23:59:00",true,false,true,false,false,false,false,"","","","",true,false,true,false,0]
["2023-12-25","Mo"," Christtag",null,"","00:00:00",null,null,"",0,"",null,null,"",null,null,"2023-12-25",true,"","F","F",0,0,0,true,false,false,"07:00:00","08:00:00","09:00:00","14:00:00","16:00:00","18:00:00",false,false,false,true,false,false,false,"00:00:00","23:59:00","00:00:00","23:59:00",true,false,true,false,false,false,false,"","","","",true,false,true,false,0]
["2023-12-26","Di"," Stefanitag",null,"","00:00:00",null,null,"",0,"",null,null,"",null,null,"2023-12-26",true,"","F","F",0,0,0,true,false,false,"07:00:00","08:00:00","09:00:00","14:00:00","16:00:00","18:00:00",false,false,false,true,false,false,false,"00:00:00","23:59:00","00:00:00","23:59:00",true,false,true,false,false,false,false,"","","","",true,false,true,false,0]
["2023-12-27","Mi"," ",null,"08:00-16:00","08:00:00",null,null,"",0,"",null,null,"",null,null,"2023-12-27",true,"","A","A",0,-0.33333333333333298,0,false,false,true,"07:00:00","08:00:00","09:00:00","14:00:00","16:00:00","18:00:00",false,true,false,true,false,false,false,"00:00:00","23:59:00","00:00:00","23:59:00",true,false,true,false,false,false,false,"","","","",true,false,true,false,0]
["2023-12-28","Do"," ",null,"08:00-16:00","08:00:00",null,null,"",0,"",null,null,"",null,null,"2023-12-28",true,"","A","A",0,-0.33333333333333298,0,false,false,true,"07:00:00","08:00:00","09:00:00","14:00:00","16:00:00","18:00:00",false,true,false,true,false,false,false,"00:00:00","23:59:00","00:00:00","23:59:00",true,false,true,false,false,false,false,"","","","",true,false,true,false,0]
["2023-12-29","Fr"," ",null,"08:00-16:00","08:00:00",null,null,"",0,"",null,null,"",null,null,"2023-12-29",true,"","A","A",0,-0.33333333333333298,0,false,false,true,"07:00:00","08:00:00","09:00:00","12:00:00","16:00:00","18:00:00",false,true,false,true,false,false,false,"00:00:00","23:59:00","00:00:00","23:59:00",true,false,true,false,false,false,false,"","","","",true,false,true,false,0]
["2023-12-30","Sa"," Wochenende",null,"","00:00:00",null,null,"",0,"",null,null,"",null,null,"2023-12-30",true,"","F","A",0,0,0,true,false,false,"","","","","","",false,false,false,true,true,false,false,"00:00:00","23:59:00","00:00:00","23:59:00",true,false,true,false,false,false,false,"00:00:00","23:59:00","00:00:00","23:59:00",true,false,true,false,0]
["2023-12-31","So"," Silvester",null,"","00:00:00",null,null,"",{"$f":"IF($R38,$X38,\"\")","v":0},"",null,null,"",null,null,"2023-12-31",true,"","F","F",0,0,0,true,false,false,"","","","","","",false,false,false,true,false,false,false,"00:00:00","23:59:00","00:00:00","23:59:00",true,false,true,false,false,false,false,"","","","",true,false,true,false,0]
["Arbeitstage",{"$f":"COUNTIF(T$8:T$38,\"A\")","v":18},null,null,{"$f":"\"Saldo Monat (~15min) > \"","v":"Saldo Monat (~15min) > "},null,null,null,{"$f":"ROUND(SUM(I8:I38)*4,0)/4","v":0},null,{"$f":"SUM(K8:K38)","v":0}," < ÜS1:2",null,{"$f":"SUM(N8:N38)","v":0},{"$f":"IF(Zeitmodell=\"Vollzeit\",\" < ÜS1:1,5 \",\" < ÜS1:1,25 \")&Zeitmodell","v":" < ÜS1:1,5 Vollzeit"},null,"Zeitmodell Text"]
["Freie Tage",{"$f":"COUNTIF(T$8:T$38,\"F\")","v":13},null,null,{"$f":"\"Saldo \"&IF(Zeitmodell=\"Vollzeit\",\"1:1,5\",\"1:1,25\")& \" (~15min) > \"","v":"Saldo 1:1,5 (~15min) > "},null,null,null,{"$f":"ROUND($N40*4,0)/4","v":0},null,null,null,null,{"$f":"IF(Zeitmodell=\"Vollzeit\",$N39*1.5,$N39*1.25)","v":0},{"$f":"IF(Zeitmodell=\"Vollzeit\",\" < 1:1,5 \",\" < 1:1,25 \")&$Q40","v":" < 1:1,5 Stunden berechnen"},null,"Stunden berechnen"]
["ZK-Tage",0,null,null,"Saldo 1:2 (~15min) > ",null,null,null,{"$f":"ROUND($N41*4,0)/4","v":0},null,null,null,null,{"$f":"K39*2","v":0}," < 1:2    Stunden berechnen"]
["ZA-Tage",{"$f":"COUNTIF(D$8:D$38,\"Z\")","v":0},null,null," Saldo Vormonat > ",null,null,null,{"$f":"$J5","v":0},null,null,null,null,null,null,null,"Gültigkeit ausbezahlt"]
["Urlaubstage",{"$f":"COUNTIF(D$8:D$38,\"U\")","v":0},null,null," Saldo Gesamt > ",null,null,null,{"$f":"SUM(I39:I42)","v":0},null,{"$f":"IF($I$43>=$R$2,\"< Hier ausbezahlte Std. eingeben. (Die Eingabe ist hier erst ab   < einem Saldo von \"&TEXT($R$2,\"#.##0,00\")&\" Std., und nur in 0,25-Schritten möglich.)\",\"\")","v":""},null,null,null,null,null,{"$f":"IF(AND($J$43<>\"\",NOT(ISNUMBER($J$43))),FALSE,OR(AND($J$43>=0,$J$43<=$I$43,MOD($J$43,0.25)=0),$J$43=\"\"))","v":true}]
["Krank",{"$f":"COUNTIF(D$8:D$38,\"K\")","v":0},null,null," Saldo Übertrag > ",null,null,null,{"$f":"$I43-$J43","v":0},{"$f":"\" < Dieser Stunden-Saldo wird in das nächste \"&IF($Q$3=\"Dezember\",\"Jahr\",\"Monat\")&\" übertragen\"","v":" < Dieser Stunden-Saldo wird in das nächste Jahr übertragen"}]
[null,null,null,"Z"]
[]
[]
[{"$f":"\"Unterschrift von \"&Vorgesetzter","v":"Unterschrift von Vorname Nachname"},null,null,null,null,null,null,null,null,null,null,{"$f":"\"Unterschrift von \"&Name","v":"Unterschrift von Vorname Nachname"}]

{"sheet":"Monat","index":13,"n_rows":48,"n_cols":60,"rows_kept":48,"cut":false,"hidden":true,"merged":[[5,27,5,32],[42,4,42,7],[38,4,38,7],[38,14,38,15],[5,7,6,7],[40,14,40,15],[38,11,38,12],[40,4,40,7],[47,0,47,3],[3,0,3,3],[3,4,3,5],[4,0,6,0],[4,1,6,1],[38,2,43,3],[5,3,6,3],[5,2,6,2],[4,2,4,3],[1,5,1,7],[2,5,2,7],[0,15,1,15],[39,14,39,15],[44,4,44,7],[39,4,39,7],[41,4,41,7],[3,15,6,15],[43,4,43,7],[5,10,6,10],[5,5,6,5],[3,14,6,14],[5,12,6,12],[47,11,47,15],[4,4,4,5],[45,4,45,7],[42,10,42,15],[41,10,41,15],[46,4,46,7],[3,6,4,8],[5,11,6,11],[5,6,6,6],[5,13,6,13]]}
[" BOKU-Zeiterfassung für Allgemeines Personal",null,null,null,null,null,null,null,null,null,null,null,null,null,null,null,"Monat","Stunden-Saldo Grenzen","Status Blatteingabe"]
[{"$f":"\" Org.-Einh. : \"&OrgEinheit","v":" Org.-Einh. : HXXXXX"},null,null,null,null,"Zeitmodell:",null,null,{"$f":"\" \"&Zeitmodell","v":" Vollzeit"},"Modus:",{"$f":"\" \"&Zeitmodus","v":" Gleitzeit"},null,null,null,null,null,{"$f":"IF(ISNA($Q$4),1,$Q$4)","v":1},{"$f":"IF($Q$2=12,NormalOGDez,NormalOG)","v":71.999999999999986},{"$f":"SUM($BH8:$BH38)","v":0}]
[{"$f":" \" Mitarbeiter/in: \"&Name","v":" Mitarbeiter/in: Vorname Nachname"},null,null,null,null,"Vorgesetzte/r:",null,null,{"$f":"\" \"&Vorgesetzter","v":" Vorname Nachname"},null,null,null,null,null,null,null,{"$f":"RIGHT(CELL(\"filename\",A1),LEN(CELL(\"filename\",A1))-SEARCH(\"]\",CELL(\"filename\",A1),1))","v":"Monat"},{"$f":"IF($Q$2=12,NormalUGDez,NormalUG)","v":-24},{"$f":"IF($Q$2=1,$S$2,$S$2+INDIRECT($S$5))","v":0}]
[{"$f":" \" Monat: \"&$Q$3&\" \"&Jahr","v":" Monat: Monat 2023"},null,null,null,"Dienstplan",null,"Normalstunden Feiertag-ÜS1:2",null,null,"Übertrag","Überstundenberechnung",null,null,null," Unterschrift des\n Vorgesetzten","Anmerkungen \n(z.B. Überstunden- notwendigkeit)",{"$f":"IF(ISNA(VLOOKUP($Q$3,MTab,2,FALSE)),1,VLOOKUP($Q$3,MTab,2,FALSE))","v":1},null,"Übertrags Adresse Blatteingabe"]
[" Datum","Wochentag","Tagesinformationen",null,{"$f":"\"Wochen-AZ\"&\" \"&TEXT(WAZ,\"[hh]:mm\")","v":"Wochen-AZ 40:00"},null,null,null,null,{"$f":"IF(ISNA($Q$5),Übertrag,INDIRECT($Q$5))","v":0},"ÜS1:2",{"$f":"IF(Zeitmodell=\"Vollzeit\",\" Überstunden1:1,5\",\" Überstunden1:1,25\")","v":" Überstunden1:1,5"},null,null,null,null,{"$f":"IF(ISNA(VLOOKUP($Q$3,MTab,3,FALSE)),\"Übertrag\",VLOOKUP($Q$3,MTab,3,FALSE))","v":"Übertrag"},null,{"$f":"IF(ISNA(VLOOKUP($Q$3,MTab,4,FALSE)),$Q$3&\"!$S$2\",VLOOKUP($Q$3,MTab,4,FALSE))","v":"Monat!$S$2"}]
[null,null," Feiertage\n Wochenende\n Urlaub, ZA, Krank","[U]rlaub\n[Z]A\n[ZK]\n[K]rank","Normal-","Soll","Von","Bis","Plus","Saldo","Plus","Von","Bis","Plus",null,null,"Hintergrundberechnungen",null,null,null,null,null,null,"Saldo aktuell",null,null,null,"GAZ-Tabellenabbildung",null,null,null,null,null,"Eingabebeprüfungen"]
[null,null,null,null,"Arbeitszeit",null,null,null,"Minus","akuell",null,null,null,null,null,null,"Datum","Monat OK","Abwesenh.","Freie Tage","ÜA-Tage","Std.","Soll-Std.",{"$f":"IF(ISNA($Q$5),Übertrag,INDIRECT($Q$5))","v":0},"Std.-Soll = 0","Std.-Soll > 0","Std.-Soll < 0",{"$f":"I_GAZGRVon","v":2},{"$f":"I_GAZNAZVon","v":3},{"$f":"I_GAZKVon","v":4},{"$f":"I_GAZKBis","v":6},{"$f":"I_GAZNAZBis","v":7},{"$f":"I_GAZGRBis","v":8},"Zeiteingabe","UZK-Eing.\nerlaubt","UZK-Eing.\ngültig","Normalst. ein erlaubt","Überstd. ein erlaubt","Normalstd.\neingegeben","Überstd.\neingegeben","Normal VON möglich OG","Normal VON möglich UG","Normal BIS möglich OG","Normal BIS möglich UG","Normal VON\n15min","Normal VON richtig","Normal BIS\n15min","Normal BIS richtig","ZA-Kern Von","ZA-Kern Bis","ZA-Kern","Über VON Obergrenze","Über VON Untergrenze","Über BIS Obergrenze","Über BIS Untergrenze","Über VON\n15min","Über VON richtig","Überl BIS\n15min","Über BIS richtig","Status Zeilen Eingabe"]
[{"$f":"IF($R8,$Q8,\"\")","v":"2023-01-01"},{"$f":"IF($R8,VLOOKUP(WEEKDAY($Q8,2),WOTA,2,FALSE),\"\")","v":"So"},{"$f":"IF($R8,\" \"&IF($S8=\"\",VLOOKUP($Q8,FListe,3,FALSE),$S8),\"\")","v":" Neujahrstag"},null,{"$f":"IF(AND($R8,$T8<>\"F\"),IF($AC8=$AF8,\"keine NAZ\",TEXT($AC8,\"hh:mm\")&\"-\"&TEXT($AF8,\"hh:mm\")),\"\")","v":""},{"$f":"IF($R8,IF($T8=\"F\",0,VLOOKUP($B8,GAZ,I_GAZNAZ,FALSE)),\"\")","v":"00:00:00"},null,null,{"$f":"IF(Zeitmodus=\"Gleitzeit\",IF($U8=\"F\",\"\",IF(AND($R8,$AM8,NOT($Y8)),ROUND(($V8-$F8)*24,2),IF($D8=\"Z\",$F8*-24,\"\"))),IF(OR($D8=\"Z\",AND($AM8,$U8=\"A\",W8<0)),ROUND($W8*24,2),\"\"))","v":""},{"$f":"IF($R8,$X8,\"\")","v":0},{"$f":"IF(AND($U8=\"F\",$AM8),ROUND($V8*24,2),\"\")","v":""},null,null,{"$f":"IF(Zeitmodus=\"Gleitzeit\",IF(AND($R8,$AN8,$M8-$L8<>0,$AL8),ROUND(($M8-$L8)*24,2),\"\"),IF(AND($AM8,$U8=\"A\",W8>0),ROUND(W8*24,2),\"\"))","v":""},null,null,{"$f":"DATE(Jahr,$Q2,1)","v":"2023-01-01"},{"$f":"$Q$2=MONTH($Q8)","v":true},{"$f":"IF(OR($D8=\"U\",$D8=\"Z\",$D8=\"ZK\",$D8=\"K\"),VLOOKUP($D8,UZK,2,FALSE),\"\")","v":""},{"$f":"IF($R8,VLOOKUP($Q8,FListe,4,FALSE),\"\")","v":"F"},{"$f":"IF($R8,VLOOKUP($Q8,FListe,5,FALSE),\"\")","v":"F"},{"$f":"$H8-$G8","v":0},{"$f":"IF($R8,ROUND($V8-$F8,15),\"\")","v":0},{"$f":"IF($I8<>\"\",$X7+$I8,$X7)","v":0},{"$f":"($W8=0)","v":true},{"$f":"($W8>0)","v":false},{"$f":"($W8<0)","v":false},{"$f":"IF(ISNA(VLOOKUP($B8,GAZ,AB$7,FALSE)),\"\",VLOOKUP($B8,GAZ,AB$7,FALSE))","v":""},"",{"$f":"IF(ISNA(VLOOKUP($B8,GAZ,AD$7,FALSE)),\"\",IF($AC8=$AF8,$G8,VLOOKUP($B8,GAZ,AD$7,FALSE)))","v":""},{"$f":"IF(ISNA(VLOOKUP($B8,GAZ,AE$7,FALSE)),\"\",IF($AC8=$AF8,$H8,VLOOKUP($B8,GAZ,AE$7,FALSE)))","v":""},"","",{"$f":"OR($G8<>\"\",$H8<>\"\",$L8<>\"\",$M8<>\"\")","v":false},{"$f":"AND($T8<>\"F\",NOT($AH8),NOT($AC8=$AF8))","v":false},{"$f":"AND($AI8,OR($D8=\"U\",$D8=\"Z\",$D8=\"K\"))","v":false},{"$f":"AND($D8<>\"U\",$D8<>\"Z\",$D8<>\"K\",$R8)","v":true},{"$f":"AND(Zeitmodus=C_Gleitzeit,$U8<>\"F\",OR($B8=\"Sa\",AND($AM8,$I8>=0,NOT($AY8))))","v":false},{"$f":"AND($G8<>\"\",$H8<>\"\")","v":false},{"$f":"OR($K8<>\"\",AND($L8<>\"\",$M8<>\"\"))","v":false},{"$f":"IF($AK8,TagUG,\"\")","v":"00:00:00"},{"$f":"IF($AK8,IF($H8=\"\",IF(AND($L8<>\"\",$L8<$AG8),$L8,IF(AND($M8<>\"\",$M8<$AG8),$M8,TagOG)),$H8),\"\")","v":"23:59:00"},{"$f":"IF($AK8,IF($G8=\"\",$AB8,$G8),\"\")","v":""},{"$f":"IF($AK8,IF(AND($L8<>\"\",$L8<$AG8),$L8,IF(AND($M8<>\"\",$M8<$AG8),$M8,TagOG)),\"\")","v":"23:59:00"},{"$f":"MOD($G8*24,0.25)=0","v":true},{"$f":"AND($AK8,ISNUMBER($G8),$G8>=$AO8,$G8<=$AP8)","v":false},{"$f":"MOD($H8*24,0.25)=0","v":true},{"$f":"AND($AK8,ISNUMBER($H8),$H8>=$AQ8,$H8<=$AR8)","v":false},{"$f":"AND(Zeitmodus=C_Gleitzeit,$B8<>\"Sa\",$G8<>\"\",$G8>$AD8)","v":false},{"$f":"AND(Zeitmodus=C_Gleitzeit,$B8<>\"Sa\",$H8<>\"\",$H8<$AE8)","v":false},{"$f":"AND($U8<>\"F\",OR($AW8,$AX8))","v":false},{"$f":"IF($B8=\"Sa\",IF($H8<>\"\",$H8,TIME(0,0,0)),IF($AL8,IF(AND($H8<>\"\",$H8>$AF8),$H8,$AF8),\"\"))","v":""},{"$f":"IF($AL8,IF($M8<>\"\",$M8,$BC8),\"\")","v":""},{"$f":"IF($B8=\"Sa\",IF($L8=\"\",TIME(0,0,0),$L8),IF($AL8,IF($L8<>\"\",$L8,IF(AND($H8<>\"\",$H8>$AF8),$H8,$AF8)),\"\"))","v":""},{"$f":"IF($AL8,TIME(23,59,0),\"\")","v":""},{"$f":"MOD($L8*24,0.25)=0","v":true},{"$f":"AND($AL8,ISNUMBER($L8),$L8>=$AZ8,$BA8>=$L8)","v":false},{"$f":"MOD($M8*24,0.25)=0","v":true},{"$f":"AND($AL8,ISNUMBER($M8),$M8>=$BB8,$M8<=$BC8)","v":false},{"$f":"IF(AND(ISBLANK($D8),ISBLANK($G8),ISBLANK($H8),ISBLANK($L8),ISBLANK($M8),ISBLANK($P8)),0,1)","v":0}]
[{"$f":"IF($R9,$Q9,\"\")","v":"2023-01-02"},"Mo"," ",null,{"$f":"IF(AND($R9,$T9<>\"F\"),IF($AC9=$AF9,\"keine NAZ\",TEXT($AC9,\"hh:mm\")&\"-\"&TEXT($AF9,\"hh:mm\")),\"\")","v":"08:00-16:00"},"08:00:00",null,null,"",0,{"$f":"IF(AND($U9=\"F\",$AM9),ROUND($V9*24,2),\"\")","v":""},null,null,"",null,null,{"$f":" Q8+1","v":"2023-01-02"},true,"","A","A",0,-0.33333333333333298,0,false,false,true,"07:00:00","08:00:00","09:00:00","14:00:00","16:00:00","18:00:00",false,{"$f":"AND($T9<>\"F\",NOT($AH9),NOT($AC9=$AF9))","v":true},false,true,{"$f":"AND(Zeitmodus=C_Gleitzeit,$U9<>\"F\",OR($B9=\"Sa\",AND($AM9,$I9>=0,NOT($AY9))))","v":false},false,{"$f":"OR($K9<>\"\",AND($L9<>\"\",$M9<>\"\"))","v":false},"00:00:00","23:59:00",{"$f":"IF($AK9,IF($G9=\"\",TagUG,$G9),\"\")","v":"00:00:00"},"23:59:00",true,false,true,false,false,false,{"$f":"AND($U9<>\"F\",OR($AW9,$AX9))","v":false},"","","","",true,false,true,false,0]
["2023-01-03","Di"," ",null,"08:00-16:00","08:00:00",null,null,"",0,"",null,null,"",null,null,"2023-01-03",true,"","A","A",0,-0.33333333333333298,0,false,false,true,"07:00:00","08:00:00","09:00:00","14:00:00","16:00:00","18:00:00",false,true,false,true,false,false,false,"00:00:00","23:59:00","00:00:00","23:59:00",true,false,true,false,false,false,false,"","","","",true,false,true,false,0]
["2023-01-04","Mi"," ",null,"08:00-16:00","08:00:00",null,null,"",0,"",null,null,"",null,null,"2023-01-04",true,"","A","A",0,-0.33333333333333298,0,false,false,true,"07:00:00","08:00:00","09:00:00","14:00:00","16:00:00","18:00:00",false,true,false,true,false,false,false,"00:00:00","23:59:00","00:00:00","23:59:00",true,false,true,false,false,false,false,"","","","",true,false,true,false,0]
["2023-01-05","Do"," ",null,"08:00-16:00","08:00:00",null,null,"",0,"",null,null,"",null,null,"2023-01-05",true,"","A","A",0,-0.33333333333333298,0,false,false,true,"07:00:00","08:00:00","09:00:00","14:00:00","16:00:00","18:00:00",false,true,false,true,false,false,false,"00:00:00","23:59:00","00:00:00","23:59:00",true,false,true,false,false,false,false,"","","","",true,false,true,false,0]
["2023-01-06","Fr"," Hl. drei Könige",null,"","00:00:00",null,null,"",0,"",null,null,"",null,null,"2023-01-06",true,"","F","F",0,0,0,true,false,false,"07:00:00","08:00:00","09:00:00","12:00:00","16:00:00","18:00:00",false,false,false,true,false,false,false,"00:00:00","23:59:00","00:00:00","23:59:00",true,false,true,false,false,false,false,"","","","",true,false,true,false,0]
["2023-01-07","Sa"," Wochenende",null,"","00:00:00",null,null,"",0,"",null,null,"",null,null,"2023-01-07",true,"","F","A",0,0,0,true,false,false,"","","","","","",false,false,false,true,true,false,false,"00:00:00","23:59:00","00:00:00","23:59:00",true,false,true,false,false,false,false,"00:00:00","23:59:00","00:00:00","23:59:00",true,false,true,false,0]
["2023-01-08","So"," Wochenende",null,"","00:00:00",null,null,"",0,"",null,null,"",null,null,"2023-01-08",true,"","F","F",0,0,0,true,false,false,"","","","","","",false,false,false,true,false,false,false,"00:00:00","23:59:00","00:00:00","23:59:00",true,false,true,false,false,false,false,"","","","",true,false,true,false,0]
["2023-01-09","Mo"," ",null,"08:00-16:00","08:00:00",null,null,"",0,"",null,null,"",null,null,"2023-01-09",true,"","A","A",0,-0.33333333333333298,0,false,false,true,"07:00:00","08:00:00","09:00:00","14:00:00","16:00:00","18:00:00",false,true,false,true,false,false,false,"00:00:00","23:59:00","00:00:00","23:59:00",true,false,true,false,false,false,false,"","","","",true,false,true,false,0]
["2023-01-10","Di"," ",null,"08:00-16:00","08:00:00",null,null,"",0,"",null,null,"",null,null,"2023-01-10",true,"","A","A",0,-0.33333333333333298,0,false,false,true,"07:00:00","08:00:00","09:00:00","14:00:00","16:00:00","18:00:00",false,true,false,true,false,false,false,"00:00:00","23:59:00","00:00:00","23:59:00",true,false,true,false,false,false,false,"","","","",true,false,true,false,0]
["2023-01-11","Mi"," ",null,"08:00-16:00","08:00:00",null,null,"",0,"",null,null,"",null,null,"2023-01-11",true,"","A","A",0,-0.33333333333333298,0,false,false,true,{"$f":"IF(ISNA(VLOOKUP($B18,GAZ,AB$7,FALSE)),\"\",VLOOKUP($B18,GAZ,AB$7,FALSE))","v":"07:00:00"},"08:00:00","09:00:00","14:00:00","16:00:00","18:00:00",false,true,false,true,false,false,false,"00:00:00","23:59:00","00:00:00","23:59:00",true,false,true,false,false,false,false,"","","","",true,false,true,false,0]
["2023-01-12","Do"," ",null,"08:00-16:00","08:00:00",null,null,"",0,"",null,null,"",null,null,"2023-01-12",true,"","A","A",0,-0.33333333333333298,0,false,false,true,"07:00:00","08:00:00","09:00:00","14:00:00","16:00:00","18:00:00",false,true,false,true,false,false,false,"00:00:00","23:59:00","00:00:00","23:59:00",true,false,true,false,false,false,false,"","","","",true,false,true,false,0]
["2023-01-13","Fr"," ",null,"08:00-16:00","08:00:00",null,null,"",0,"",null,null,"",null,null,"2023-01-13",true,"","A","A",0,-0.33333333333333298,0,false,false,true,"07:00:00","08:00:00","09:00:00","12:00:00","16:00:00","18:00:00",false,true,false,true,false,false,false,"00:00:00","23:59:00","00:00:00","23:59:00",true,false,true,false,false,false,false,"","","","",true,false,true,false,0]
["2023-01-14","Sa"," Wochenende",null,"","00:00:00",null,null,"",0,"",null,null,"",null,null,"2023-01-14",true,"","F","A",0,0,0,true,false,false,"","","","","","",false,false,false,true,true,false,false,"00:00:00","23:59:00","00:00:00","23:59:00",true,false,true,false,false,false,false,"00:00:00","23:59:00","00:00:00","23:59:00",true,false,true,false,0]
["2023-01-15","So"," Wochenende",null,"","00:00:00",null,null,"",0,"",null,null,"",null,null,"2023-01-15",true,"","F","F",0,0,0,true,false,false,"","","","","","",false,false,false,true,false,false,false,"00:00:00","23:59:00","00:00:00","23:59:00",true,false,true,false,false,false,false,"","","","",true,false,true,false,0]
["2023-01-16","Mo"," ",null,"08:00-16:00","08:00:00",null,null,"",0,"",null,null,"",null,null,"2023-01-16",true,"","A","A",0,-0.33333333333333298,0,false,false,true,"07:00:00","08:00:00","09:00:00","14:00:00","16:00:00","18:00:00",false,true,false,true,false,false,false,"00:00:00","23:59:00","00:00:00","23:59:00",true,false,true,false,false,false,false,"","","","",true,false,true,false,0]
["2023-01-17","Di"," ",null,"08:00-16:00","08:00:00",null,null,"",0,"",null,null,"",null,null,"2023-01-17",true,"","A","A",0,-0.33333333333333298,0,false,false,true,"07:00:00","08:00:00","09:00:00","14:00:00","16:00:00","18:00:00",false,true,false,true,false,false,false,"00:00:00","23:59:00","00:00:00","23:59:00",true,false,true,false,false,false,false,"","","","",true,false,true,false,0]
["2023-01-18","Mi"," ",null,"08:00-16:00","08:00:00",null,null,"",0,"",null,null,"",null,null,"2023-01-18",true,"","A","A",0,-0.33333333333333298,0,false,false,true,"07:00:00","08:00:00","09:00:00","14:00:00","16:00:00","18:00:00",false,true,false,true,false,false,false,"00:00:00","23:59:00","00:00:00","23:59:00",true,false,true,false,false,false,false,"","","","",true,false,true,false,0]
["2023-01-19","Do"," ",null,"08:00-16:00","08:00:00",null,null,"",0,"",null,null,"",null,null,"2023-01-19",true,"","A","A",0,-0.33333333333333298,0,false,false,true,"07:00:00","08:00:00","09:00:00","14:00:00","16:00:00","18:00:00",false,true,false,true,false,false,false,"00:00:00","23:59:00","00:00:00","23:59:00",true,false,true,false,false,false,false,"","","","",true,false,true,false,0]
["2023-01-20","Fr"," ",null,"08:00-16:00","08:00:00",null,null,"",0,"",null,null,"",null,null,"2023-01-20",true,"","A","A",0,-0.33333333333333298,0,false,false,true,"07:00:00","08:00:00","09:00:00","12:00:00","16:00:00","18:00:00",false,true,false,true,false,false,false,"00:00:00","23:59:00","00:00:00","23:59:00",true,false,true,false,false,false,false,"","","","",true,false,true,false,0]
["2023-01-21","Sa"," Wochenende",null,"","00:00:00",null,null,"",0,"",null,null,"",null,null,"2023-01-21",true,"","F","A",0,0,0,true,false,false,{"$f":"IF(ISNA(VLOOKUP($B28,GAZ,AB$7,FALSE)),\"\",VLOOKUP($B28,GAZ,AB$7,FALSE))","v":""},"","","","","",false,false,false,true,true,false,false,"00:00:00","23:59:00","00:00:00","23:59:00",true,false,true,false,false,false,false,"00:00:00","23:59:00","00:00:00","23:59:00",true,false,true,false,0]
["2023-01-22","So"," Wochenende",null,"","00:00:00",null,null,"",0,"",null,null,"",null,null,"2023-01-22",true,"","F","F",0,0,0,true,false,false,"","","","","","",false,false,false,true,false,false,false,"00:00:00","23:59:00","00:00:00","23:59:00",true,false,true,false,false,false,false,"","","","",true,false,true,false,0]
["2023-01-23","Mo"," ",null,"08:00-16:00","08:00:00",null,null,"",0,"",null,null,"",null,null,"2023-01-23",true,"","A","A",0,-0.33333333333333298,0,false,false,true,"07:00:00","08:00:00","09:00:00","14:00:00","16:00:00","18:00:00",false,true,false,true,false,false,false,"00:00:00","23:59:00","00:00:00","23:59:00",true,false,true,false,false,false,false,"","","","",true,false,true,false,0]
["2023-01-24","Di"," ",null,"08:00-16:00","08:00:00",null,null,"",0,"",null,null,"",null,null,"2023-01-24",true,"","A","A",0,-0.33333333333333298,0,false,false,true,"07:00:00","08:00:00","09:00:00","14:00:00","16:00:00","18:00:00",false,true,false,true,false,false,false,"00:00:00","23:59:00","00:00:00","23:59:00",true,false,true,false,false,false,false,"","","","",true,false,true,false,0]
["2023-01-25","Mi"," ",null,"08:00-16:00","08:00:00",null,null,"",0,"",null,null,"",null,null,"2023-01-25",true,"","A","A",0,-0.33333333333333298,0,false,false,true,"07:00:00","08:00:00","09:00:00","14:00:00","16:00:00","18:00:00",false,true,false,true,false,false,false,"00:00:00","23:59:00","00:00:00","23:59:00",true,false,true,false,false,false,false,"","","","",true,false,true,false,0]
["2023-01-26","Do"," ",null,"08:00-16:00","08:00:00",null,null,"",0,"",null,null,"",null,null,"2023-01-26",true,"","A","A",0,-0.33333333333333298,0,false,false,true,"07:00:00","08:00:00","09:00:00","14:00:00","16:00:00","18:00:00",false,true,false,true,false,false,false,"00:00:00","23:59:00","00:00:00","23:59:00",true,false,true,false,false,false,false,"","","","",true,false,true,false,0]
["2023-01-27","Fr"," ",null,"08:00-16:00","08:00:00",null,null,"",0,"",null,null,"",null,null,"2023-01-27",true,"","A","A",0,-0.33333333333333298,0,false,false,true,"07:00:00","08:00:00","09:00:00","12:00:00","16:00:00","18:00:00",false,true,false,true,false,false,false,"00:00:00","23:59:00","00:00:00","23:59:00",true,false,true,false,false,false,false,"","","","",true,false,true,false,0]
["2023-01-28","Sa"," Wochenende",null,"","00:00:00",null,null,"",0,"",null,null,"",null,null,"2023-01-28",true,"","F","A",0,0,0,true,false,false,"","","","","","",false,false,false,true,true,false,false,"00:00:00","23:59:00","00:00:00","23:59:00",true,false,true,false,false,false,false,"00:00:00","23:59:00","00:00:00","23:59:00",true,false,true,false,0]
["2023-01-29","So"," Wochenende",null,"","00:00:00",null,null,"",0,"",null,null,"",null,null,"2023-01-29",true,"","F","F",0,0,0,true,false,false,"","","","","","",false,false,false,true,false,false,false,"00:00:00","23:59:00","00:00:00","23:59:00",true,false,true,false,false,false,false,"","","","",true,false,true,false,0]
["2023-01-30","Mo"," ",null,"08:00-16:00","08:00:00",null,null,"",0,"",null,null,"",null,null,"2023-01-30",true,"","A","A",0,-0.33333333333333298,0,false,false,true,"07:00:00","08:00:00","09:00:00","14:00:00","16:00:00","18:00:00",false,true,false,true,false,false,false,"00:00:00","23:59:00","00:00:00","23:59:00",true,false,true,false,false,false,false,"","","","",true,false,true,false,0]
["2023-01-31","Di"," ",null,"08:00-16:00","08:00:00",null,null,"",{"$f":"IF($R38,$X38,\"\")","v":0},"",null,null,"",null,null,"2023-01-31",true,"","A","A",0,-0.33333333333333298,0,false,false,true,"07:00:00","08:00:00","09:00:00","14:00:00","16:00:00","18:00:00",false,true,false,true,false,false,false,"00:00:00","23:59:00","00:00:00","23:59:00",true,false,true,false,false,false,false,"","","","",true,false,true,false,0]
["Arbeitstage",{"$f":"COUNTIF(T$8:T$38,\"A\")","v":21},null,null,{"$f":"\"Saldo Monat (~15min) > \"","v":"Saldo Monat (~15min) > "},null,null,null,{"$f":"ROUND(SUM(I8:I38)*4,0)/4","v":0},null,{"$f":"SUM(K8:K38)","v":0}," < ÜS1:2",null,{"$f":"SUM(N8:N38)","v":0},{"$f":"IF(Zeitmodell=\"Vollzeit\",\" < ÜS1:1,5 \",\" < ÜS1:1,25 \")&Zeitmodell","v":" < ÜS1:1,5 Vollzeit"},null,"Zeitmodell Text"]
["Freie Tage",{"$f":"COUNTIF(T$8:T$38,\"F\")","v":10},null,null,{"$f":"\"Saldo \"&IF(Zeitmodell=\"Vollzeit\",\"1:1,5\",\"1:1,25\")& \" (~15min) > \"","v":"Saldo 1:1,5 (~15min) > "},null,null,null,{"$f":"ROUND($N40*4,0)/4","v":0},null,null,null,null,{"$f":"IF(Zeitmodell=\"Vollzeit\",$N39*1.5,$N39*1.25)","v":0},{"$f":"IF(Zeitmodell=\"Vollzeit\",\" < 1:1,5 \",\" < 1:1,25 \")&$Q40","v":" < 1:1,5 Stunden berechnen"},null,"Stunden berechnen"]
["ZK-Tage",0,null,null,"Saldo 1:2 (~15min) > ",null,null,null,{"$f":"ROUND($N41*4,0)/4","v":0},null,null,null,null,{"$f":"K39*2","v":0}," < 1:2    Stunden berechnen"]
["ZA-Tage",{"$f":"COUNTIF(D$8:D$38,\"Z\")","v":0},null,null," Saldo Vormonat > ",null,null,null,{"$f":"$J5","v":0},null,null,null,null,null,null,null,"Gültigkeit ausbezahlt"]
["Urlaubstage",{"$f":"COUNTIF(D$8:D$38,\"U\")","v":0},null,null," Saldo Gesamt > ",null,null,null,{"$f":"SUM(I39:I42)","v":0},null,{"$f":"IF($I$43>=$R$2,\"< Hier ausbezahlte Std. eingeben. (Die Eingabe ist hier erst ab   < einem Saldo von \"&TEXT($R$2,\"#.##0,00\")&\" Std., und nur in 0,25-Schritten möglich.)\",\"\")","v":""},null,null,null,null,null,{"$f":"IF(AND($J$43<>\"\",NOT(ISNUMBER($J$43))),FALSE,OR(AND($J$43>=0,$J$43<=$I$43,MOD($J$43,0.25)=0),$J$43=\"\"))","v":true}]
["Krank",{"$f":"COUNTIF(D$8:D$38,\"K\")","v":0},null,null," Saldo Übertrag > ",null,null,null,{"$f":"$I43-$J43","v":0},{"$f":"\" < Dieser Stunden-Saldo wird in das nächste \"&IF($Q$3=\"Dezember\",\"Jahr\",\"Monat\")&\" übertragen\"","v":" < Dieser Stunden-Saldo wird in das nächste Monat übertragen"}]
[null,null,null,"Z"]
[]
[]
[{"$f":"\"Unterschrift von \"&Vorgesetzter","v":"Unterschrift von Vorname Nachname"},null,null,null,null,null,null,null,null,null,null,{"$f":"\"Unterschrift von \"&Name","v":"Unterschrift von Vorname Nachname"}]

{"sheet":"Hilfskonfig","index":14,"n_rows":14,"n_cols":16,"rows_kept":14,"cut":false,"hidden":true,"merged":[[0,0,0,1],[0,4,0,7],[0,2,0,3],[0,8,0,11]]}
["GAZ-Zuordnung",null,"Stundengrenzen",null,"NAZ-Definiton Standard",null,null,null,"Monats-Setup",null,null,null,"Übertrag Adresse","Blatteintrag Adresse","Zeitmodus","Zeitmodell"]
["Spaltenname","Spalte","NormalOG",{"$f":"72*WAZ*24/40","v":71.999999999999986},"NAZVon","KZVon","KZBis","NAZBis","Name","Nr.","Vorgänger Übertrag","Vorgänger Blatteingabe",{"$f":"\"!$I$44\"","v":"!$I$44"},{"$f":"\"!$S$3\"","v":"!$S$3"},"Gleitzeit","Vollzeit"]
["GAZ Wochentage",1,"NormalUG",{"$f":"-24*WAZ*24/40","v":-24},{"$f":"IF(Zeitmodell=\"Vollzeit\",TIME(8,0,0),TIME(9,0,0))","v":0.33333333333333331},0.375,0.58333333333333337,{"$f":"IF(Zeitmodell=\"Vollzeit\",TIME(16,0,0),TIME(13,0,0))","v":0.66666666666666663},"Jänner",1,"Übertrag","Jänner!$S$2",null,null,"keine GZ","Teilzeit"]
["GAZ Gleitzeitrahmen Von",{"$f":"B3+1","v":2},"NormalOGDez",{"$f":"24*WAZ*24/40","v":24},{"$f":"IF(Zeitmodell=\"Vollzeit\",TIME(8,0,0),TIME(9,0,0))","v":0.33333333333333331},0.375,0.58333333333333337,{"$f":"IF(Zeitmodell=\"Vollzeit\",TIME(16,0,0),TIME(13,0,0))","v":0.66666666666666663},"Februar",2,{"$f":"$I3&$M$2","v":"Jänner!$I$44"},{"$f":"$I3&$N$2","v":"Jänner!$S$3"}]
["GAZ Normalarbeitszeit Von",3,"NormalUGDez",{"$f":"-8*WAZ*24/40","v":-8},{"$f":"IF(Zeitmodell=\"Vollzeit\",TIME(8,0,0),TIME(9,0,0))","v":0.33333333333333331},0.375,0.58333333333333337,{"$f":"IF(Zeitmodell=\"Vollzeit\",TIME(16,0,0),TIME(13,0,0))","v":0.66666666666666663},"März",3,"Februar!$I$44",{"$f":"$I4&$N$2","v":"Februar!$S$3"}]
["GAZ Kernzeit Von",4,"TagOG",{"$f":"TIME(23,59,0)","v":"23:59:00"},{"$f":"IF(Zeitmodell=\"Vollzeit\",TIME(8,0,0),TIME(9,0,0))","v":0.33333333333333331},0.375,0.58333333333333337,{"$f":"IF(Zeitmodell=\"Vollzeit\",TIME(16,0,0),TIME(13,0,0))","v":0.66666666666666663},"April",4,"März!$I$44","März!$S$3"]
["GAZ Kernzeit Bis",{"$f":"$B6+2","v":6},"TagUG",{"$f":"TIME(0,0,0)","v":"00:00:00"},{"$f":"IF(Zeitmodell=\"Vollzeit\",TIME(8,0,0),TIME(9,0,0))","v":0.33333333333333331},0.375,0.5,{"$f":"IF(Zeitmodell=\"Vollzeit\",TIME(16,0,0),TIME(13,0,0))","v":0.66666666666666663},"Mai",5,"April!$I$44","April!$S$3"]
["GAZ Normalarbeitszeit Bis",7,null,null,null,null,null,null,"Juni",6,"Mai!$I$44","Mai!$S$3"]
["GAZ Gleitzeitrahmen Bis",8,null,null,null,null,null,null,"Juli",7,"Juni!$I$44","Juni!$S$3"]
["GAZ Normalarbeitszeitstunden",9,null,null,null,null,null,null,"August",8,"Juli!$I$44","Juli!$S$3"]
[null,null,null,null,null,null,null,null,"September",9,"August!$I$44","August!$S$3"]
[null,null,null,null,null,null,null,null,"Oktober",10,"September!$I$44","September!$S$3"]
[null,null,null,null,null,null,null,null,"November",11,"Oktober!$I$44","Oktober!$S$3"]
[null,null,null,null,null,null,null,null,"Dezember",12,"November!$I$44","November!$S$3"]

{"sheet":"Feiertage","index":15,"n_rows":367,"n_cols":15,"rows_kept":367,"cut":false,"hidden":true,"merged":[[0,0,0,1],[0,11,0,12],[0,13,0,14]]}
["Feiertagsberechnung",null,"Datum","WT","Freie Feiertage","Frei","Datum","WT","Feiertage","Frei/\nnicht Frei","Ü-AT","Abwesenheiten",null,"Wochentage"]
["Jahr",{"$f":"Jahr","v":2023},{"$f":"DATE(FJ,1,1)","v":"2023-01-01"},{"$f":"VLOOKUP(WEEKDAY($C2,2),WOTA,2,FALSE)","v":"So"},"Neujahrstag","FF",{"$f":"DATE(FJ,1,1)","v":"2023-01-01"},{"$f":"VLOOKUP(WEEKDAY($G2,2),WOTA,2,FALSE)","v":"So"},{"$f":"IF(ISNA(VLOOKUP(G2,Feiertage,3,FALSE)),IF(OR($H2=\"Sa\",$H2=\"So\"),\"Wochenende\",\"\"),VLOOKUP(G2,Feiertage,3,FALSE))","v":"Neujahrstag"},{"$f":"IF(ISNA(VLOOKUP($G2,Feiertage,3,FALSE)),IF(AND($H2<>\"So\",$H2<>\"Sa\"),\"A\",\"F\"),IF(OR(VLOOKUP($G2,Feiertage,4,FALSE)=\"FF\",$H2=\"Sa\",$H2=\"So\"),\"F\",\"A\"))","v":"F"},{"$f":"IF(ISNA(VLOOKUP($G2,Feiertage,3,FALSE)),IF($H2=\"So\",\"F\",\"A\"),IF(VLOOKUP($G2,Feiertage,4,FALSE)=\"FF\",\"F\",\"A\"))","v":"F"},"U","Urlaub",1,"Mo"]
["OS",{"$f":"DOLLAR(DATE(Jahr,4,DAY(MINUTE(Jahr/38)/2+55))/7,)*7-IF(YEAR(1)=1904,5,6)","v":"2023-04-09"},{"$f":"DATE(FJ,1,6)","v":"2023-01-06"},"Fr","Hl. drei Könige","FF",{"$f":"G2+1","v":"2023-01-02"},{"$f":"VLOOKUP(WEEKDAY($G3,2),WOTA,2,FALSE)","v":"Mo"},"","A","A","Z","Zeitausgleich",2,"Di"]
[null,null,{"$f":"OS+1","v":"2023-04-10"},"Mo","Ostermontag","FF",{"$f":"G3+1","v":"2023-01-03"},"Di","","A","A","ZK","ZA-Kernzeit",3,"Mi"]
[null,null,{"$f":"DATE(FJ,5,1)","v":"2023-05-01"},"Mo","Staatsfeiertag","FF","2023-01-04","Mi","","A","A","K","Krank",4,"Do"]
[null,null,{"$f":"OS+39","v":"2023-05-18"},"Do","Christi Himmelfahrt","FF","2023-01-05","Do","","A","A",null,null,5,"Fr"]
[null,null,{"$f":"OS+50","v":"2023-05-29"},"Mo","Pfingstmontag","FF","2023-01-06","Fr","Hl. drei Könige","F","F",null,null,6,"Sa"]
[null,null,{"$f":"OS+60","v":"2023-06-08"},"Do","Fronleichnam","FF","2023-01-07","Sa","Wochenende","F","A",null,null,7,"So"]
[null,null,{"$f":"DATE(FJ,8,15)","v":"2023-08-15"},"Di","Maria Himmelfahrt","FF","2023-01-08","So","Wochenende","F","F"]
[null,null,{"$f":"DATE(FJ,10,26)","v":"2023-10-26"},"Do","Nationalfeiertag","FF","2023-01-09","Mo","","A","A"]
[null,null,{"$f":"DATE(FJ,11,1)","v":"2023-11-01"},"Mi","Allerheiligen","FF","2023-01-10","Di","","A","A"]
[null,null,{"$f":"DATE(FJ,12,8)","v":"2023-12-08"},"Fr","Maria Empfängnis","FF","2023-01-11","Mi","","A","A"]
[null,null,{"$f":"DATE(FJ,12,25)","v":"2023-12-25"},"Mo","Christtag","FF","2023-01-12","Do","","A","A"]
[null,null,{"$f":"DATE(FJ,12,26)","v":"2023-12-26"},"Di","Stefanitag","FF","2023-01-13","Fr","","A","A"]
[null,null,"Datum","WT","Nichtfreie Feiertage","Frei","2023-01-14","Sa","Wochenende","F","A"]
[null,null,{"$f":"OS-46","v":"2023-02-22"},{"$f":"VLOOKUP(WEEKDAY($C16,2),WOTA,2,FALSE)","v":"Mi"},"Aschermittwoch",{"$f":"IF(D16<>\"So\",\"FA\",\"FF\")","v":"FA"},"2023-01-15","So","Wochenende","F","F"]
[null,null,{"$f":"DATE(FJ,2,14)","v":"2023-02-14"},"Di","Valentinstag",{"$f":"IF(D17<>\"So\",\"FA\",\"FF\")","v":"FA"},"2023-01-16","Mo","","A","A"]
[null,null,{"$f":"OS-7","v":"2023-04-02"},"So","Palmsonntag","FF","2023-01-17","Di","","A","A"]
[null,null,{"$f":"OS-3","v":"2023-04-06"},"Do","Gründonnerstag","FA","2023-01-18","Mi","","A","A"]
[null,null,{"$f":"OS-2","v":"2023-04-07"},"Fr","Karfreitag","FA","2023-01-19","Do","","A","A"]
[null,null,{"$f":"OS","v":"2023-04-09"},"So","Ostersonntag","FF","2023-01-20","Fr","","A","A"]
[null,null,{"$f":"OS+2","v":"2023-04-11"},"Di","Osterdienstag",{"$f":"IF(D22<>\"So\",\"FA\",\"FF\")","v":"FA"},"2023-01-21","Sa","Wochenende","F","A"]
[null,null,{"$f":"DATE(FJ,5,1)-WEEKDAY(DATE(FJ,5,1),2)+14-(7*(DATE(FJ,5,1)-WEEKDAY(DATE(FJ,5,1),2)+14=ROUND((DAY(MINUTE(FJ/38)/2+55)&\".4.\"&FJ)/7,)*7-6+49))","v":"2023-05-14"},"So","Muttertag","FF","2023-01-22","So","Wochenende","F","F"]
[null,null,{"$f":"OS+49","v":"2023-05-28"},"So","Pfingsten","FF","2023-01-23","Mo","","A","A"]
[null,null,{"$f":"DATE(Jahr,6,1)+15-WEEKDAY(DATE(Jahr,6,1)+14)","v":"2023-06-11"},"So","Vatertag","FF","2023-01-24","Di","","A","A"]
[null,null,{"$f":"DATE(FJ,11,2)","v":"2023-11-02"},"Do","Allerseelen","FA","2023-01-25","Mi","","A","A"]
[null,null,{"$f":"DATE(FJ,11,15)","v":"2023-11-15"},"Mi","St. Leopold","FA","2023-01-26","Do","","A","A"]
[null,null,{"$f":"DATE(FJ,12,6)","v":"2023-12-06"},"Mi","St. Nikolaus","FA","2023-01-27","Fr","","A","A"]
[null,null,{"$f":"C30-7","v":"2023-12-03"},"So","1. Advent","FF","2023-01-28","Sa","Wochenende","F","A"]
[null,null,{"$f":"C31-7","v":"2023-12-10"},"So","2. Advent","FF","2023-01-29","So","Wochenende","F","F"]
[null,null,{"$f":"C32-7","v":"2023-12-17"},"So","3. Advent","FF","2023-01-30","Mo","","A","A"]
[null,null,{"$f":"DATE(FJ,12,24)-WEEKDAY(DATE(FJ,12,24))+1","v":"2023-12-24"},"So","4. Advent","FF","2023-01-31","Di","","A","A"]
[null,null,{"$f":"DATE(FJ,12,24)","v":"2023-12-24"},"So","Hl. Abend","FF","2023-02-01","Mi","","A","A"]
[null,null,{"$f":"DATE(FJ,12,31)","v":"2023-12-31"},"So","Silvester","FF","2023-02-02","Do","","A","A"]
[null,null,null,null,null,null,"2023-02-03","Fr","","A","A"]
[null,null,null,null,null,null,"2023-02-04","Sa","Wochenende","F","A"]
[null,null,null,null,null,null,"2023-02-05","So","Wochenende","F","F"]
[null,null,null,null,null,null,"2023-02-06","Mo","","A","A"]
[null,null,null,null,null,null,"2023-02-07","Di","","A","A"]
[null,null,null,null,null,null,"2023-02-08","Mi","","A","A"]
[null,null,null,null,null,null,"2023-02-09","Do","","A","A"]
[null,null,null,null,null,null,"2023-02-10","Fr","","A","A"]
[null,null,null,null,null,null,"2023-02-11","Sa","Wochenende","F","A"]
[null,null,null,null,null,null,"2023-02-12","So","Wochenende","F","F"]
[null,null,null,null,null,null,"2023-02-13","Mo","","A","A"]
[null,null,null,null,null,null,"2023-02-14","Di","Valentinstag","A","A"]
[null,null,null,null,null,null,"2023-02-15","Mi","","A","A"]
[null,null,null,null,null,null,"2023-02-16","Do","","A","A"]
[null,null,null,null,null,null,"2023-02-17","Fr","","A","A"]
[null,null,null,null,null,null,"2023-02-18","Sa","Wochenende","F","A"]
[null,null,null,null,null,null,"2023-02-19","So","Wochenende","F","F"]
[null,null,null,null,null,null,"2023-02-20","Mo","","A","A"]
[null,null,null,null,null,null,"2023-02-21","Di","","A","A"]
[null,null,null,null,null,null,"2023-02-22","Mi","Aschermittwoch","A","A"]
[null,null,null,null,null,null,"2023-02-23","Do","","A","A"]
[null,null,null,null,null,null,"2023-02-24","Fr","","A","A"]
[null,null,null,null,null,null,"2023-02-25","Sa","Wochenende","F","A"]
[null,null,null,null,null,null,"2023-02-26","So","Wochenende","F","F"]
[null,null,null,null,null,null,"2023-02-27","Mo","","A","A"]
[null,null,null,null,null,null,"2023-02-28","Di","","A","A"]
[null,null,null,null,null,null,"2023-03-01","Mi","","A","A"]
[null,null,null,null,null,null,"2023-03-02","Do","","A","A"]
[null,null,null,null,null,null,"2023-03-03","Fr","","A","A"]
[null,null,null,null,null,null,"2023-03-04","Sa","Wochenende","F","A"]
[null,null,null,null,null,null,"2023-03-05","So","Wochenende","F","F"]
[null,null,null,null,null,null,"2023-03-06",{"$f":"VLOOKUP(WEEKDAY($G66,2),WOTA,2,FALSE)","v":"Mo"},{"$f":"IF(ISNA(VLOOKUP(G66,Feiertage,3,FALSE)),IF(OR($H66=\"Sa\",$H66=\"So\"),\"Wochenende\",\"\"),VLOOKUP(G66,Feiertage,3,FALSE))","v":""},{"$f":"IF(ISNA(VLOOKUP($G66,Feiertage,3,FALSE)),IF(AND($H66<>\"So\",$H66<>\"Sa\"),\"A\",\"F\"),IF(OR(VLOOKUP($G66,Feiertage,4,FALSE)=\"FF\",$H66=\"Sa\",$H66=\"So\"),\"F\",\"A\"))","v":"A"},{"$f":"IF(ISNA(VLOOKUP($G66,Feiertage,3,FALSE)),IF($H66=\"So\",\"F\",\"A\"),IF(VLOOKUP($G66,Feiertage,4,FALSE)=\"FF\",\"F\",\"A\"))","v":"A"}]
[null,null,null,null,null,null,"2023-03-07","Di","","A","A"]
[null,null,null,null,null,null,{"$f":"G67+1","v":"2023-03-08"},"Mi","","A","A"]
[null,null,null,null,null,null,"2023-03-09","Do","","A","A"]
[null,null,null,null,null,null,"2023-03-10","Fr","","A","A"]
[null,null,null,null,null,null,"2023-03-11","Sa","Wochenende","F","A"]
[null,null,null,null,null,null,"2023-03-12","So","Wochenende","F","F"]
[null,null,null,null,null,null,"2023-03-13","Mo","","A","A"]
[null,null,null,null,null,null,"2023-03-14","Di","","A","A"]
[null,null,null,null,null,null,"2023-03-15","Mi","","A","A"]
[null,null,null,null,null,null,"2023-03-16","Do","","A","A"]
[null,null,null,null,null,null,"2023-03-17","Fr","","A","A"]
[null,null,null,null,null,null,"2023-03-18","Sa","Wochenende","F","A"]
[null,null,null,null,null,null,"2023-03-19","So","Wochenende","F","F"]
[null,null,null,null,null,null,"2023-03-20","Mo","","A","A"]
[null,null,null,null,null,null,"2023-03-21","Di","","A","A"]
[null,null,null,null,null,null,"2023-03-22","Mi","","A","A"]
[null,null,null,null,null,null,"2023-03-23","Do","","A","A"]
[null,null,null,null,null,null,"2023-03-24","Fr","","A","A"]
[null,null,null,null,null,null,"2023-03-25","Sa","Wochenende","F","A"]
[null,null,null,null,null,null,"2023-03-26","So","Wochenende","F","F"]
[null,null,null,null,null,null,"2023-03-27","Mo","","A","A"]
[null,null,null,null,null,null,"2023-03-28","Di","","A","A"]
[null,null,null,null,null,null,"2023-03-29","Mi","","A","A"]
[null,null,null,null,null,null,"2023-03-30","Do","","A","A"]
[null,null,null,null,null,null,"2023-03-31","Fr","","A","A"]
[null,null,null,null,null,null,"2023-04-01","Sa","Wochenende","F","A"]
[null,null,null,null,null,null,"2023-04-02","So","Palmsonntag","F","F"]
[null,null,null,null,null,null,"2023-04-03","Mo","","A","A"]
[null,null,null,null,null,null,"2023-04-04","Di","","A","A"]
[null,null,null,null,null,null,"2023-04-05","Mi","","A","A"]
[null,null,null,null,null,null,"2023-04-06","Do","Gründonnerstag","A","A"]
[null,null,null,null,null,null,"2023-04-07","Fr","Karfreitag","A","A"]
[null,null,null,null,null,null,"2023-04-08","Sa","Wochenende","F","A"]
[null,null,null,null,null,null,"2023-04-09","So","Ostersonntag","F","F"]
[null,null,null,null,null,null,"2023-04-10","Mo","Ostermontag","F","F"]
[null,null,null,null,null,null,"2023-04-11","Di","Osterdienstag","A","A"]
[null,null,null,null,null,null,"2023-04-12","Mi","","A","A"]
[null,null,null,null,null,null,"2023-04-13","Do","","A","A"]
[null,null,null,null,null,null,"2023-04-14","Fr","","A","A"]
[null,null,null,null,null,null,"2023-04-15","Sa","Wochenende","F","A"]
[null,null,null,null,null,null,"2023-04-16","So","Wochenende","F","F"]
[null,null,null,null,null,null,"2023-04-17","Mo","","A","A"]
[null,null,null,null,null,null,"2023-04-18","Di","","A","A"]
[null,null,null,null,null,null,"2023-04-19","Mi","","A","A"]
[null,null,null,null,null,null,"2023-04-20","Do","","A","A"]
[null,null,null,null,null,null,"2023-04-21","Fr","","A","A"]
[null,null,null,null,null,null,"2023-04-22","Sa","Wochenende","F","A"]
[null,null,null,null,null,null,"2023-04-23","So","Wochenende","F","F"]
[null,null,null,null,null,null,"2023-04-24","Mo","","A","A"]
[null,null,null,null,null,null,"2023-04-25","Di","","A","A"]
[null,null,null,null,null,null,"2023-04-26","Mi","","A","A"]
[null,null,null,null,null,null,"2023-04-27","Do","","A","A"]
[null,null,null,null,null,null,"2023-04-28","Fr","","A","A"]
[null,null,null,null,null,null,"2023-04-29","Sa","Wochenende","F","A"]
[null,null,null,null,null,null,"2023-04-30","So","Wochenende","F","F"]
[null,null,null,null,null,null,"2023-05-01","Mo","Staatsfeiertag","F","F"]
[null,null,null,null,null,null,"2023-05-02","Di","","A","A"]
[null,null,null,null,null,null,"2023-05-03","Mi","","A","A"]
[null,null,null,null,null,null,"2023-05-04","Do","","A","A"]
[null,null,null,null,null,null,"2023-05-05","Fr","","A","A"]
[null,null,null,null,null,null,"2023-05-06","Sa","Wochenende","F","A"]
[null,null,null,null,null,null,"2023-05-07","So","Wochenende","F","F"]
[null,null,null,null,null,null,"2023-05-08","Mo","","A","A"]
[null,null,null,null,null,null,"2023-05-09",{"$f":"VLOOKUP(WEEKDAY($G130,2),WOTA,2,FALSE)","v":"Di"},{"$f":"IF(ISNA(VLOOKUP(G130,Feiertage,3,FALSE)),IF(OR($H130=\"Sa\",$H130=\"So\"),\"Wochenende\",\"\"),VLOOKUP(G130,Feiertage,3,FALSE))","v":""},{"$f":"IF(ISNA(VLOOKUP($G130,Feiertage,3,FALSE)),IF(AND($H130<>\"So\",$H130<>\"Sa\"),\"A\",\"F\"),IF(OR(VLOOKUP($G130,Feiertage,4,FALSE)=\"FF\",$H130=\"Sa\",$H130=\"So\"),\"F\",\"A\"))","v":"A"},{"$f":"IF(ISNA(VLOOKUP($G130,Feiertage,3,FALSE)),IF($H130=\"So\",\"F\",\"A\"),IF(VLOOKUP($G130,Feiertage,4,FALSE)=\"FF\",\"F\",\"A\"))","v":"A"}]
[null,null,null,null,null,null,"2023-05-10","Mi","","A","A"]
[null,null,null,null,null,null,{"$f":"G131+1","v":"2023-05-11"},"Do","","A","A"]
[null,null,null,null,null,null,"2023-05-12","Fr","","A","A"]
[null,null,null,null,null,null,"2023-05-13","Sa","Wochenende","F","A"]
[null,null,null,null,null,null,"2023-05-14","So","Muttertag","F","F"]
[null,null,null,null,null,null,"2023-05-15","Mo","","A","A"]
[null,null,null,null,null,null,"2023-05-16","Di","","A","A"]
[null,null,null,null,null,null,"2023-05-17","Mi","","A","A"]
[null,null,null,null,null,null,"2023-05-18","Do","Christi Himmelfahrt","F","F"]
[null,null,null,null,null,null,"2023-05-19","Fr","","A","A"]
[null,null,null,null,null,null,"2023-05-20","Sa","Wochenende","F","A"]
[null,null,null,null,null,null,"2023-05-21","So","Wochenende","F","F"]
[null,null,null,null,null,null,"2023-05-22","Mo","","A","A"]
[null,null,null,null,null,null,"2023-05-23","Di","","A","A"]
[null,null,null,null,null,null,"2023-05-24","Mi","","A","A"]
[null,null,null,null,null,null,"2023-05-25","Do","","A","A"]
[null,null,null,null,null,null,"2023-05-26","Fr","","A","A"]
[null,null,null,null,null,null,"2023-05-27","Sa","Wochenende","F","A"]
[null,null,null,null,null,null,"2023-05-28","So","Pfingsten","F","F"]
[null,null,null,null,null,null,"2023-05-29","Mo","Pfingstmontag","F","F"]
[null,null,null,null,null,null,"2023-05-30","Di","","A","A"]
[null,null,null,null,null,null,"2023-05-31","Mi","","A","A"]
[null,null,null,null,null,null,"2023-06-01","Do","","A","A"]
[null,null,null,null,null,null,"2023-06-02","Fr","","A","A"]
[null,null,null,null,null,null,"2023-06-03","Sa","Wochenende","F","A"]
[null,null,null,null,null,null,"2023-06-04","So","Wochenende","F","F"]
[null,null,null,null,null,null,"2023-06-05","Mo","","A","A"]
[null,null,null,null,null,null,"2023-06-06","Di","","A","A"]
[null,null,null,null,null,null,"2023-06-07","Mi","","A","A"]
[null,null,null,null,null,null,"2023-06-08","Do","Fronleichnam","F","F"]
[null,null,null,null,null,null,"2023-06-09","Fr","","A","A"]
[null,null,null,null,null,null,"2023-06-10","Sa","Wochenende","F","A"]
[null,null,null,null,null,null,"2023-06-11","So","Vatertag","F","F"]
[null,null,null,null,null,null,"2023-06-12","Mo","","A","A"]
[null,null,null,null,null,null,"2023-06-13","Di","","A","A"]
[null,null,null,null,null,null,"2023-06-14","Mi","","A","A"]
[null,null,null,null,null,null,"2023-06-15","Do","","A","A"]
[null,null,null,null,null,null,"2023-06-16","Fr","","A","A"]
[null,null,null,null,null,null,"2023-06-17","Sa","Wochenende","F","A"]
[null,null,null,null,null,null,"2023-06-18","So","Wochenende","F","F"]
[null,null,null,null,null,null,"2023-06-19","Mo","","A","A"]
[null,null,null,null,null,null,"2023-06-20","Di","","A","A"]
[null,null,null,null,null,null,"2023-06-21","Mi","","A","A"]
[null,null,null,null,null,null,"2023-06-22","Do","","A","A"]
[null,null,null,null,null,null,"2023-06-23","Fr","","A","A"]
[null,null,null,null,null,null,"2023-06-24","Sa","Wochenende","F","A"]
[null,null,null,null,null,null,"2023-06-25","So","Wochenende","F","F"]
[null,null,null,null,null,null,"2023-06-26","Mo","","A","A"]
[null,null,null,null,null,null,"2023-06-27","Di","","A","A"]
[null,null,null,null,null,null,"2023-06-28","Mi","","A","A"]
[null,null,null,null,null,null,"2023-06-29","Do","","A","A"]
[null,null,null,null,null,null,"2023-06-30","Fr","","A","A"]
[null,null,null,null,null,null,"2023-07-01","Sa","Wochenende","F","A"]
[null,null,null,null,null,null,"2023-07-02","So","Wochenende","F","F"]
[null,null,null,null,null,null,"2023-07-03","Mo","","A","A"]
[null,null,null,null,null,null,"2023-07-04","Di","","A","A"]
[null,null,null,null,null,null,"2023-07-05","Mi","","A","A"]
[null,null,null,null,null,null,"2023-07-06","Do","","A","A"]
[null,null,null,null,null,null,"2023-07-07","Fr","","A","A"]
[null,null,null,null,null,null,"2023-07-08","Sa","Wochenende","F","A"]
[null,null,null,null,null,null,"2023-07-09","So","Wochenende","F","F"]
[null,null,null,null,null,null,"2023-07-10","Mo","","A","A"]
[null,null,null,null,null,null,"2023-07-11","Di","","A","A"]
[null,null,null,null,null,null,"2023-07-12",{"$f":"VLOOKUP(WEEKDAY($G194,2),WOTA,2,FALSE)","v":"Mi"},{"$f":"IF(ISNA(VLOOKUP(G194,Feiertage,3,FALSE)),IF(OR($H194=\"Sa\",$H194=\"So\"),\"Wochenende\",\"\"),VLOOKUP(G194,Feiertage,3,FALSE))","v":""},{"$f":"IF(ISNA(VLOOKUP($G194,Feiertage,3,FALSE)),IF(AND($H194<>\"So\",$H194<>\"Sa\"),\"A\",\"F\"),IF(OR(VLOOKUP($G194,Feiertage,4,FALSE)=\"FF\",$H194=\"Sa\",$H194=\"So\"),\"F\",\"A\"))","v":"A"},{"$f":"IF(ISNA(VLOOKUP($G194,Feiertage,3,FALSE)),IF($H194=\"So\",\"F\",\"A\"),IF(VLOOKUP($G194,Feiertage,4,FALSE)=\"FF\",\"F\",\"A\"))","v":"A"}]
[null,null,null,null,null,null,"2023-07-13","Do","","A","A"]
[null,null,null,null,null,null,{"$f":"G195+1","v":"2023-07-14"},"Fr","","A","A"]
[null,null,null,null,null,null,"2023-07-15","Sa","Wochenende","F","A"]
[null,null,null,null,null,null,"2023-07-16","So","Wochenende","F","F"]
[null,null,null,null,null,null,"2023-07-17","Mo","","A","A"]
[null,null,null,null,null,null,"2023-07-18","Di","","A","A"]
[null,null,null,null,null,null,"2023-07-19","Mi","","A","A"]
[null,null,null,null,null,null,"2023-07-20","Do","","A","A"]
[null,null,null,null,null,null,"2023-07-21","Fr","","A","A"]
[null,null,null,null,null,null,"2023-07-22","Sa","Wochenende","F","A"]
[null,null,null,null,null,null,"2023-07-23","So","Wochenende","F","F"]
[null,null,null,null,null,null,"2023-07-24","Mo","","A","A"]
[null,null,null,null,null,null,"2023-07-25","Di","","A","A"]
[null,null,null,null,null,null,"2023-07-26","Mi","","A","A"]
[null,null,null,null,null,null,"2023-07-27","Do","","A","A"]
[null,null,null,null,null,null,"2023-07-28","Fr","","A","A"]
[null,null,null,null,null,null,"2023-07-29","Sa","Wochenende","F","A"]
[null,null,null,null,null,null,"2023-07-30","So","Wochenende","F","F"]
[null,null,null,null,null,null,"2023-07-31","Mo","","A","A"]
[null,null,null,null,null,null,"2023-08-01","Di","","A","A"]
[null,null,null,null,null,null,"2023-08-02","Mi","","A","A"]
[null,null,null,null,null,null,"2023-08-03","Do","","A","A"]
[null,null,null,null,null,null,"2023-08-04","Fr","","A","A"]
[null,null,null,null,null,null,"2023-08-05","Sa","Wochenende","F","A"]
[null,null,null,null,null,null,"2023-08-06","So","Wochenende","F","F"]
[null,null,null,null,null,null,"2023-08-07","Mo","","A","A"]
[null,null,null,null,null,null,"2023-08-08","Di","","A","A"]
[null,null,null,null,null,null,"2023-08-09","Mi","","A","A"]
[null,null,null,null,null,null,"2023-08-10","Do","","A","A"]
[null,null,null,null,null,null,"2023-08-11","Fr","","A","A"]
[null,null,null,null,null,null,"2023-08-12","Sa","Wochenende","F","A"]
[null,null,null,null,null,null,"2023-08-13","So","Wochenende","F","F"]
[null,null,null,null,null,null,"2023-08-14","Mo","","A","A"]
[null,null,null,null,null,null,"2023-08-15","Di","Maria Himmelfahrt","F","F"]
[null,null,null,null,null,null,"2023-08-16","Mi","","A","A"]
[null,null,null,null,null,null,"2023-08-17","Do","","A","A"]
[null,null,null,null,null,null,"2023-08-18","Fr","","A","A"]
[null,null,null,null,null,null,"2023-08-19","Sa","Wochenende","F","A"]
[null,null,null,null,null,null,"2023-08-20","So","Wochenende","F","F"]
[null,null,null,null,null,null,"2023-08-21","Mo","","A","A"]
[null,null,null,null,null,null,"2023-08-22","Di","","A","A"]
[null,null,null,null,null,null,"2023-08-23","Mi","","A","A"]
[null,null,null,null,null,null,"2023-08-24","Do","","A","A"]
[null,null,null,null,null,null,"2023-08-25","Fr","","A","A"]
[null,null,null,null,null,null,"2023-08-26","Sa","Wochenende","F","A"]
[null,null,null,null,null,null,"2023-08-27","So","Wochenende","F","F"]
[null,null,null,null,null,null,"2023-08-28","Mo","","A","A"]
[null,null,null,null,null,null,"2023-08-29","Di","","A","A"]
[null,null,null,null,null,null,"2023-08-30","Mi","","A","A"]
[null,null,null,null,null,null,"2023-08-31","Do","","A","A"]
[null,null,null,null,null,null,"2023-09-01","Fr","","A","A"]
[null,null,null,null,null,null,"2023-09-02","Sa","Wochenende","F","A"]
[null,null,null,null,null,null,"2023-09-03","So","Wochenende","F","F"]
[null,null,null,null,null,null,"2023-09-04","Mo","","A","A"]
[null,null,null,null,null,null,"2023-09-05","Di","","A","A"]
[null,null,null,null,null,null,"2023-09-06","Mi","","A","A"]
[null,null,null,null,null,null,"2023-09-07","Do","","A","A"]
[null,null,null,null,null,null,"2023-09-08","Fr","","A","A"]
[null,null,null,null,null,null,"2023-09-09","Sa","Wochenende","F","A"]
[null,null,null,null,null,null,"2023-09-10","So","Wochenende","F","F"]
[null,null,null,null,null,null,"2023-09-11","Mo","","A","A"]
[null,null,null,null,null,null,"2023-09-12","Di","","A","A"]
[null,null,null,null,null,null,"2023-09-13","Mi","","A","A"]
[null,null,null,null,null,null,"2023-09-14",{"$f":"VLOOKUP(WEEKDAY($G258,2),WOTA,2,FALSE)","v":"Do"},{"$f":"IF(ISNA(VLOOKUP(G258,Feiertage,3,FALSE)),IF(OR($H258=\"Sa\",$H258=\"So\"),\"Wochenende\",\"\"),VLOOKUP(G258,Feiertage,3,FALSE))","v":""},{"$f":"IF(ISNA(VLOOKUP($G258,Feiertage,3,FALSE)),IF(AND($H258<>\"So\",$H258<>\"Sa\"),\"A\",\"F\"),IF(OR(VLOOKUP($G258,Feiertage,4,FALSE)=\"FF\",$H258=\"Sa\",$H258=\"So\"),\"F\",\"A\"))","v":"A"},{"$f":"IF(ISNA(VLOOKUP($G258,Feiertage,3,FALSE)),IF($H258=\"So\",\"F\",\"A\"),IF(VLOOKUP($G258,Feiertage,4,FALSE)=\"FF\",\"F\",\"A\"))","v":"A"}]
[null,null,null,null,null,null,"2023-09-15","Fr","","A","A"]
[null,null,null,null,null,null,{"$f":"G259+1","v":"2023-09-16"},"Sa","Wochenende","F","A"]
[null,null,null,null,null,null,"2023-09-17","So","Wochenende","F","F"]
[null,null,null,null,null,null,"2023-09-18","Mo","","A","A"]
[null,null,null,null,null,null,"2023-09-19","Di","","A","A"]
[null,null,null,null,null,null,"2023-09-20","Mi","","A","A"]
[null,null,null,null,null,null,"2023-09-21","Do","","A","A"]
[null,null,null,null,null,null,"2023-09-22","Fr","","A","A"]
[null,null,null,null,null,null,"2023-09-23","Sa","Wochenende","F","A"]
[null,null,null,null,null,null,"2023-09-24","So","Wochenende","F","F"]
[null,null,null,null,null,null,"2023-09-25","Mo","","A","A"]
[null,null,null,null,null,null,"2023-09-26","Di","","A","A"]
[null,null,null,null,null,null,"2023-09-27","Mi","","A","A"]
[null,null,null,null,null,null,"2023-09-28","Do","","A","A"]
[null,null,null,null,null,null,"2023-09-29","Fr","","A","A"]
[null,null,null,null,null,null,"2023-09-30","Sa","Wochenende","F","A"]
[null,null,null,null,null,null,"2023-10-01","So","Wochenende","F","F"]
[null,null,null,null,null,null,"2023-10-02","Mo","","A","A"]
[null,null,null,null,null,null,"2023-10-03","Di","","A","A"]
[null,null,null,null,null,null,"2023-10-04","Mi","","A","A"]
[null,null,null,null,null,null,"2023-10-05","Do","","A","A"]
[null,null,null,null,null,null,"2023-10-06","Fr","","A","A"]
[null,null,null,null,null,null,"2023-10-07","Sa","Wochenende","F","A"]
[null,null,null,null,null,null,"2023-10-08","So","Wochenende","F","F"]
[null,null,null,null,null,null,"2023-10-09","Mo","","A","A"]
[null,null,null,null,null,null,"2023-10-10","Di","","A","A"]
[null,null,null,null,null,null,"2023-10-11","Mi","","A","A"]
[null,null,null,null,null,null,"2023-10-12","Do","","A","A"]
[null,null,null,null,null,null,"2023-10-13","Fr","","A","A"]
[null,null,null,null,null,null,"2023-10-14","Sa","Wochenende","F","A"]
[null,null,null,null,null,null,"2023-10-15","So","Wochenende","F","F"]
[null,null,null,null,null,null,"2023-10-16","Mo","","A","A"]
[null,null,null,null,null,null,"2023-10-17","Di","","A","A"]
[null,null,null,null,null,null,"2023-10-18","Mi","","A","A"]
[null,null,null,null,null,null,"2023-10-19","Do","","A","A"]
[null,null,null,null,null,null,"2023-10-20","Fr","","A","A"]
[null,null,null,null,null,null,"2023-10-21","Sa","Wochenende","F","A"]
[null,null,null,null,null,null,"2023-10-22","So","Wochenende","F","F"]
[null,null,null,null,null,null,"2023-10-23","Mo","","A","A"]
[null,null,null,null,null,null,"2023-10-24","Di","","A","A"]
[null,null,null,null,null,null,"2023-10-25","Mi","","A","A"]
[null,null,null,null,null,null,"2023-10-26","Do","Nationalfeiertag","F","F"]
[null,null,null,null,null,null,"2023-10-27","Fr","","A","A"]
[null,null,null,null,null,null,"2023-10-28","Sa","Wochenende","F","A"]
[null,null,null,null,null,null,"2023-10-29","So","Wochenende","F","F"]
[null,null,null,null,null,null,"2023-10-30","Mo","","A","A"]
[null,null,null,null,null,null,"2023-10-31","Di","","A","A"]
[null,null,null,null,null,null,"2023-11-01","Mi","Allerheiligen","F","F"]
[null,null,null,null,null,null,"2023-11-02","Do","Allerseelen","A","A"]
[null,null,null,null,null,null,"2023-11-03","Fr","","A","A"]
[null,null,null,null,null,null,"2023-11-04","Sa","Wochenende","F","A"]
[null,null,null,null,null,null,"2023-11-05","So","Wochenende","F","F"]
[null,null,null,null,null,null,"2023-11-06","Mo","","A","A"]
[null,null,null,null,null,null,"2023-11-07","Di","","A","A"]
[null,null,null,null,null,null,"2023-11-08","Mi","","A","A"]
[null,null,null,null,null,null,"2023-11-09","Do","","A","A"]
[null,null,null,null,null,null,"2023-11-10","Fr","","A","A"]
[null,null,null,null,null,null,"2023-11-11","Sa","Wochenende","F","A"]
[null,null,null,null,null,null,{"$f":"G316+1","v":"2023-11-12"},"So","Wochenende","F","F"]
[null,null,null,null,null,null,{"$f":"G317+1","v":"2023-11-13"},"Mo","","A","A"]
[null,null,null,null,null,null,"2023-11-14","Di","","A","A"]
[null,null,null,null,null,null,"2023-11-15","Mi","St. Leopold","A","A"]
[null,null,null,null,null,null,"2023-11-16","Do","","A","A"]
[null,null,null,null,null,null,"2023-11-17",{"$f":"VLOOKUP(WEEKDAY($G322,2),WOTA,2,FALSE)","v":"Fr"},{"$f":"IF(ISNA(VLOOKUP(G322,Feiertage,3,FALSE)),IF(OR($H322=\"Sa\",$H322=\"So\"),\"Wochenende\",\"\"),VLOOKUP(G322,Feiertage,3,FALSE))","v":""},{"$f":"IF(ISNA(VLOOKUP($G322,Feiertage,3,FALSE)),IF(AND($H322<>\"So\",$H322<>\"Sa\"),\"A\",\"F\"),IF(OR(VLOOKUP($G322,Feiertage,4,FALSE)=\"FF\",$H322=\"Sa\",$H322=\"So\"),\"F\",\"A\"))","v":"A"},{"$f":"IF(ISNA(VLOOKUP($G322,Feiertage,3,FALSE)),IF($H322=\"So\",\"F\",\"A\"),IF(VLOOKUP($G322,Feiertage,4,FALSE)=\"FF\",\"F\",\"A\"))","v":"A"}]
[null,null,null,null,null,null,"2023-11-18","Sa","Wochenende","F","A"]
[null,null,null,null,null,null,"2023-11-19","So","Wochenende","F","F"]
[null,null,null,null,null,null,"2023-11-20","Mo","","A","A"]
[null,null,null,null,null,null,"2023-11-21","Di","","A","A"]
[null,null,null,null,null,null,"2023-11-22","Mi","","A","A"]
[null,null,null,null,null,null,"2023-11-23","Do","","A","A"]
[null,null,null,null,null,null,"2023-11-24","Fr","","A","A"]
[null,null,null,null,null,null,"2023-11-25","Sa","Wochenende","F","A"]
[null,null,null,null,null,null,{"$f":"G330+1","v":"2023-11-26"},"So","Wochenende","F","F"]
[null,null,null,null,null,null,"2023-11-27","Mo","","A","A"]
[null,null,null,null,null,null,"2023-11-28","Di","","A","A"]
[null,null,null,null,null,null,"2023-11-29","Mi","","A","A"]
[null,null,null,null,null,null,"2023-11-30","Do","","A","A"]
[null,null,null,null,null,null,"2023-12-01","Fr","","A","A"]
[null,null,null,null,null,null,{"$f":"G336+1","v":"2023-12-02"},"Sa","Wochenende","F","A"]
[null,null,null,null,null,null,"2023-12-03","So","1. Advent","F","F"]
[null,null,null,null,null,null,"2023-12-04","Mo","","A","A"]
[null,null,null,null,null,null,"2023-12-05","Di","","A","A"]
[null,null,null,null,null,null,"2023-12-06","Mi","St. Nikolaus","A","A"]
[null,null,null,null,null,null,"2023-12-07","Do","","A","A"]
[null,null,null,null,null,null,"2023-12-08","Fr","Maria Empfängnis","F","F"]
[null,null,null,null,null,null,"2023-12-09","Sa","Wochenende","F","A"]
[null,null,null,null,null,null,"2023-12-10","So","2. Advent","F","F"]
[null,null,null,null,null,null,"2023-12-11","Mo","","A","A"]
[null,null,null,null,null,null,"2023-12-12","Di","","A","A"]
[null,null,null,null,null,null,"2023-12-13","Mi","","A","A"]
[null,null,null,null,null,null,"2023-12-14","Do","","A","A"]
[null,null,null,null,null,null,"2023-12-15","Fr","","A","A"]
[null,null,null,null,null,null,"2023-12-16","Sa","Wochenende","F","A"]
[null,null,null,null,null,null,"2023-12-17","So","3. Advent","F","F"]
[null,null,null,null,null,null,"2023-12-18","Mo","","A","A"]
[null,null,null,null,null,null,"2023-12-19","Di","","A","A"]
[null,null,null,null,null,null,"2023-12-20","Mi","","A","A"]
[null,null,null,null,null,null,"2023-12-21","Do","","A","A"]
[null,null,null,null,null,null,"2023-12-22","Fr","","A","A"]
[null,null,null,null,null,null,"2023-12-23","Sa","Wochenende","F","A"]
[null,null,null,null,null,null,"2023-12-24","So","4. Advent","F","F"]
[null,null,null,null,null,null,"2023-12-25","Mo","Christtag","F","F"]
[null,null,null,null,null,null,"2023-12-26","Di","Stefanitag","F","F"]
[null,null,null,null,null,null,"2023-12-27","Mi","","A","A"]
[null,null,null,null,null,null,"2023-12-28","Do","","A","A"]
[null,null,null,null,null,null,"2023-12-29","Fr","","A","A"]
[null,null,null,null,null,null,"2023-12-30","Sa","Wochenende","F","A"]
[null,null,null,null,null,null,{"$f":"G365+1","v":"2023-12-31"},"So","Silvester","F","F"]
[null,null,null,null,null,null,{"$f":"G366+1","v":"2024-01-01"},"Mo","","A","A"]

{"sheet":"MakroTest","index":16,"n_rows":0,"n_cols":0,"rows_kept":0,"cut":false,"hidden":false,"merged":[]}

{"sheet":"Dummy","index":17,"n_rows":0,"n_cols":0,"rows_kept":0,"cut":false,"hidden":true,"merged":[]}

{"sheet":"Format","index":18,"n_rows":48,"n_cols":60,"rows_kept":48,"cut":false,"hidden":true,"merged":[[47,0,47,3],[47,11,47,15],[42,4,42,7],[42,10,42,15],[43,4,43,7],[44,4,44,7],[45,4,45,7],[46,4,46,7],[38,2,43,3],[38,4,38,7],[39,14,39,15],[40,4,40,7],[40,14,40,15],[41,4,41,7],[41,10,41,15],[38,14,38,15],[5,27,5,32],[4,2,4,3],[4,4,4,5],[5,2,6,2],[5,3,6,3],[5,5,6,5],[5,6,6,6],[5,7,6,7],[5,10,6,10],[5,11,6,11],[5,12,6,12],[5,13,6,13],[39,4,39,7],[0,15,1,15],[1,5,1,7],[2,5,2,7],[38,11,38,12],[3,0,3,3],[3,4,3,5],[3,6,4,8],[3,14,6,14],[3,15,6,15],[4,0,6,0],[4,1,6,1]]}
[" BOKU-Zeiterfassung für Allgemeines Personal",null,null,null,null,null,null,null,null,null,null,null,null,null,null,null,"Monat","Stunden-Saldo Grenzen","Status Blatteingabe"]
[{"$f":"\" Org.-Einh. : \"&OrgEinheit","v":" Org.-Einh. : HXXXXX"},null,null,null,null,"Zeitmodell:",null,null,{"$f":"\" \"&Zeitmodell","v":" Vollzeit"},"Modus:",{"$f":"\" \"&Zeitmodus","v":" Gleitzeit"},null,null,null,null,null,{"$f":"IF(ISNA($Q$4),1,$Q$4)","v":1},{"$f":"IF($Q$2=12,NormalOGDez,NormalOG)","v":71.999999999999986},{"$f":"SUM($BH8:$BH38)","v":0}]
[{"$f":" \" Mitarbeiter/in: \"&Name","v":" Mitarbeiter/in: Vorname Nachname"},null,null,null,null,"Vorgesetzte/r:",null,null,{"$f":"\" \"&Vorgesetzter","v":" Vorname Nachname"},null,null,null,null,null,null,null,{"$f":"RIGHT(CELL(\"filename\",A1),LEN(CELL(\"filename\",A1))-SEARCH(\"]\",CELL(\"filename\",A1),1))","v":"Format"},{"$f":"IF($Q$2=12,NormalUGDez,NormalUG)","v":-24},{"$f":"IF($Q$2=1,$S$2,$S$2+INDIRECT($S$5))","v":0}]
[{"$f":" \" Monat: \"&$Q$3&\" \"&Jahr","v":" Monat: Format 2023"},null,null,null,"Dienstplan",null,"Normalstunden Feiertag-ÜS1:2",null,null,"Übertrag","Überstundenberechnung",null,null,null," Unterschrift des\n Vorgesetzten","Anmerkungen \n(z.B. Überstunden- notwendigkeit)",{"$f":"IF(ISNA(VLOOKUP($Q$3,MTab,2,FALSE)),1,VLOOKUP($Q$3,MTab,2,FALSE))","v":1},null,"Übertrags Adresse Blatteingabe"]
[" Datum","Wochentag","Tagesinformationen",null,{"$f":"\"Wochen-AZ\"&\" \"&TEXT(WAZ,\"[hh]:mm\")","v":"Wochen-AZ 40:00"},null,null,null,null,{"$f":"IF(ISNA($Q$5),Übertrag,INDIRECT($Q$5))","v":0},"ÜS1:2",{"$f":"IF(Zeitmodell=\"Vollzeit\",\" Überstunden1:1,5\",\" Überstunden1:1,25\")","v":" Überstunden1:1,5"},null,null,null,null,{"$f":"IF(ISNA(VLOOKUP($Q$3,MTab,3,FALSE)),\"Übertrag\",VLOOKUP($Q$3,MTab,3,FALSE))","v":"Übertrag"},null,{"$f":"IF(ISNA(VLOOKUP($Q$3,MTab,4,FALSE)),$Q$3&\"!$S$2\",VLOOKUP($Q$3,MTab,4,FALSE))","v":"Format!$S$2"}]
[null,null," Feiertage\n Wochenende\n Urlaub, ZA, Krank","[U]rlaub\n[Z]A\n[ZK]\n[K]rank","Normal-","Soll","Von","Bis","Plus","Saldo","Plus","Von","Bis","Plus",null,null,"Hintergrundberechnungen",null,null,null,null,null,null,"Saldo aktuell",null,null,null,"GAZ-Tabellenabbildung",null,null,null,null,null,"Eingabebeprüfungen"]
[null,null,null,null,"Arbeitszeit",null,null,null,"Minus","akuell",null,null,null,null,null,null,"Datum","Monat OK","Abwesenh.","Freie Tage","ÜA-Tage","Std.","Soll-Std.",{"$f":"IF(ISNA($Q$5),Übertrag,INDIRECT($Q$5))","v":0},"Std.-Soll = 0","Std.-Soll > 0","Std.-Soll < 0",{"$f":"I_GAZGRVon","v":2},{"$f":"I_GAZNAZVon","v":3},{"$f":"I_GAZKVon","v":4},{"$f":"I_GAZKBis","v":6},{"$f":"I_GAZNAZBis","v":7},{"$f":"I_GAZGRBis","v":8},"Zeiteingabe","UZK-Eing.\nerlaubt","UZK-Eing.\ngültig","Normalst. ein erlaubt","Überstd. ein erlaubt","Normalstd.\neingegeben","Überstd.\neingegeben","Normal VON möglich OG","Normal VON möglich UG","Normal BIS möglich OG","Normal BIS möglich UG","Normal VON\n15min","Normal VON richtig","Normal BIS\n15min","Normal BIS richtig","ZA-Kern Von","ZA-Kern Bis","ZA-Kern","Über VON Obergrenze","Über VON Untergrenze","Über BIS Obergrenze","Über BIS Untergrenze","Über VON\n15min","Über VON richtig","Überl BIS\n15min","Über BIS richtig","Status Zeilen Eingabe"]
[{"$f":"IF($R8,$Q8,\"\")","v":"2023-01-01"},{"$f":"IF($R8,VLOOKUP(WEEKDAY($Q8,2),WOTA,2,FALSE),\"\")","v":"So"},{"$f":"IF($R8,\" \"&IF($S8=\"\",VLOOKUP($Q8,FListe,3,FALSE),$S8),\"\")","v":" Neujahrstag"},null,{"$f":"IF(AND($R8,$T8<>\"F\"),IF($AC8=$AF8,\"keine NAZ\",TEXT($AC8,\"hh:mm\")&\"-\"&TEXT($AF8,\"hh:mm\")),\"\")","v":""},{"$f":"IF($R8,IF($T8=\"F\",0,VLOOKUP($B8,GAZ,I_GAZNAZ,FALSE)),\"\")","v":"00:00:00"},null,null,{"$f":"IF(Zeitmodus=\"Gleitzeit\",IF($U8=\"F\",\"\",IF(AND($R8,$AM8,NOT($Y8)),ROUND(($V8-$F8)*24,2),IF($D8=\"Z\",$F8*-24,\"\"))),IF(OR($D8=\"Z\",AND($AM8,$U8=\"A\",W8<0)),ROUND($W8*24,2),\"\"))","v":""},{"$f":"IF($R8,$X8,\"\")","v":0},{"$f":"IF(AND($U8=\"F\",$AM8),ROUND($V8*24,2),\"\")","v":""},null,null,{"$f":"IF(Zeitmodus=\"Gleitzeit\",IF(AND($R8,$AN8,$M8-$L8<>0,$AL8),ROUND(($M8-$L8)*24,2),\"\"),IF(AND($AM8,$U8=\"A\",W8>0),ROUND(W8*24,2),\"\"))","v":""},null,null,{"$f":"DATE(Jahr,$Q2,1)","v":"2023-01-01"},{"$f":"$Q$2=MONTH($Q8)","v":true},{"$f":"IF(OR($D8=\"U\",$D8=\"Z\",$D8=\"ZK\",$D8=\"K\"),VLOOKUP($D8,UZK,2,FALSE),\"\")","v":""},{"$f":"IF($R8,VLOOKUP($Q8,FListe,4,FALSE),\"\")","v":"F"},{"$f":"IF($R8,VLOOKUP($Q8,FListe,5,FALSE),\"\")","v":"F"},{"$f":"$H8-$G8","v":0},{"$f":"IF($R8,ROUND($V8-$F8,15),\"\")","v":0},{"$f":"IF($I8<>\"\",$X7+$I8,$X7)","v":0},{"$f":"($W8=0)","v":true},{"$f":"($W8>0)","v":false},{"$f":"($W8<0)","v":false},{"$f":"IF(ISNA(VLOOKUP($B8,GAZ,AB$7,FALSE)),\"\",VLOOKUP($B8,GAZ,AB$7,FALSE))","v":""},"",{"$f":"IF(ISNA(VLOOKUP($B8,GAZ,AD$7,FALSE)),\"\",IF($AC8=$AF8,$G8,VLOOKUP($B8,GAZ,AD$7,FALSE)))","v":""},{"$f":"IF(ISNA(VLOOKUP($B8,GAZ,AE$7,FALSE)),\"\",IF($AC8=$AF8,$H8,VLOOKUP($B8,GAZ,AE$7,FALSE)))","v":""},"","",{"$f":"OR($G8<>\"\",$H8<>\"\",$L8<>\"\",$M8<>\"\")","v":false},{"$f":"AND($T8<>\"F\",NOT($AH8),NOT($AC8=$AF8))","v":false},{"$f":"AND($AI8,OR($D8=\"U\",$D8=\"Z\",$D8=\"K\"))","v":false},{"$f":"AND($D8<>\"U\",$D8<>\"Z\",$D8<>\"K\",$R8)","v":true},{"$f":"AND(Zeitmodus=C_Gleitzeit,$U8<>\"F\",OR($B8=\"Sa\",AND($AM8,$I8>=0,NOT($AY8))))","v":false},{"$f":"AND($G8<>\"\",$H8<>\"\")","v":false},{"$f":"OR($K8<>\"\",AND($L8<>\"\",$M8<>\"\"))","v":false},{"$f":"IF($AK8,TagUG,\"\")","v":"00:00:00"},{"$f":"IF($AK8,IF($H8=\"\",IF(AND($L8<>\"\",$L8<$AG8),$L8,IF(AND($M8<>\"\",$M8<$AG8),$M8,TagOG)),$H8),\"\")","v":"23:59:00"},{"$f":"IF($AK8,IF($G8=\"\",$AB8,$G8),\"\")","v":""},{"$f":"IF($AK8,IF(AND($L8<>\"\",$L8<$AG8),$L8,IF(AND($M8<>\"\",$M8<$AG8),$M8,TagOG)),\"\")","v":"23:59:00"},{"$f":"MOD($G8*24,0.25)=0","v":true},{"$f":"AND($AK8,ISNUMBER($G8),$G8>=$AO8,$G8<=$AP8)","v":false},{"$f":"MOD($H8*24,0.25)=0","v":true},{"$f":"AND($AK8,ISNUMBER($H8),$H8>=$AQ8,$H8<=$AR8)","v":false},{"$f":"AND(Zeitmodus=C_Gleitzeit,$B8<>\"Sa\",$G8<>\"\",$G8>$AD8)","v":false},{"$f":"AND(Zeitmodus=C_Gleitzeit,$B8<>\"Sa\",$H8<>\"\",$H8<$AE8)","v":false},{"$f":"AND($U8<>\"F\",OR($AW8,$AX8))","v":false},{"$f":"IF($B8=\"Sa\",IF($H8<>\"\",$H8,TIME(0,0,0)),IF($AL8,IF(AND($H8<>\"\",$H8>$AF8),$H8,$AF8),\"\"))","v":""},{"$f":"IF($AL8,IF($M8<>\"\",$M8,$BC8),\"\")","v":""},{"$f":"IF($B8=\"Sa\",IF($L8=\"\",TIME(0,0,0),$L8),IF($AL8,IF($L8<>\"\",$L8,IF(AND($H8<>\"\",$H8>$AF8),$H8,$AF8)),\"\"))","v":""},{"$f":"IF($AL8,TIME(23,59,0),\"\")","v":""},{"$f":"MOD($L8*24,0.25)=0","v":true},{"$f":"AND($AL8,ISNUMBER($L8),$L8>=$AZ8,$BA8>=$L8)","v":false},{"$f":"MOD($M8*24,0.25)=0","v":true},{"$f":"AND($AL8,ISNUMBER($M8),$M8>=$BB8,$M8<=$BC8)","v":false},{"$f":"IF(AND(ISBLANK($D8),ISBLANK($G8),ISBLANK($H8),ISBLANK($L8),ISBLANK($M8),ISBLANK($P8)),0,1)","v":0}]
[{"$f":"IF($R9,$Q9,\"\")","v":"2023-01-02"},"Mo"," ",null,{"$f":"IF(AND($R9,$T9<>\"F\"),IF($AC9=$AF9,\"keine NAZ\",TEXT($AC9,\"hh:mm\")&\"-\"&TEXT($AF9,\"hh:mm\")),\"\")","v":"08:00-16:00"},"08:00:00",null,null,"",0,{"$f":"IF(AND($U9=\"F\",$AM9),ROUND($V9*24,2),\"\")","v":""},null,null,"",null,null,{"$f":" Q8+1","v":"2023-01-02"},true,"","A","A",0,-0.33333333333333298,0,false,false,true,"07:00:00","08:00:00","09:00:00","14:00:00","16:00:00","18:00:00",false,{"$f":"AND($T9<>\"F\",NOT($AH9),NOT($AC9=$AF9))","v":true},false,true,{"$f":"AND(Zeitmodus=C_Gleitzeit,$U9<>\"F\",OR($B9=\"Sa\",AND($AM9,$I9>=0,NOT($AY9))))","v":false},false,{"$f":"OR($K9<>\"\",AND($L9<>\"\",$M9<>\"\"))","v":false},"00:00:00","23:59:00",{"$f":"IF($AK9,IF($G9=\"\",TagUG,$G9),\"\")","v":"00:00:00"},"23:59:00",true,false,true,false,false,false,{"$f":"AND($U9<>\"F\",OR($AW9,$AX9))","v":false},"","","","",true,false,true,false,0]
["2023-01-03","Di"," ",null,"08:00-16:00","08:00:00",null,null,"",0,"",null,null,"",null,null,"2023-01-03",true,"","A","A",0,-0.33333333333333298,0,false,false,true,"07:00:00","08:00:00","09:00:00","14:00:00","16:00:00","18:00:00",false,true,false,true,false,false,false,"00:00:00","23:59:00","00:00:00","23:59:00",true,false,true,false,false,false,false,"","","","",true,false,true,false,0]
["2023-01-04","Mi"," ",null,"08:00-16:00","08:00:00",null,null,"",0,"",null,null,"",null,null,"2023-01-04",true,"","A","A",0,-0.33333333333333298,0,false,false,true,"07:00:00","08:00:00","09:00:00","14:00:00","16:00:00","18:00:00",false,true,false,true,false,false,false,"00:00:00","23:59:00","00:00:00","23:59:00",true,false,true,false,false,false,false,"","","","",true,false,true,false,0]
["2023-01-05","Do"," ",null,"08:00-16:00","08:00:00",null,null,"",0,"",null,null,"",null,null,"2023-01-05",true,"","A","A",0,-0.33333333333333298,0,false,false,true,"07:00:00","08:00:00","09:00:00","14:00:00","16:00:00","18:00:00",false,true,false,true,false,false,false,"00:00:00","23:59:00","00:00:00","23:59:00",true,false,true,false,false,false,false,"","","","",true,false,true,false,0]
["2023-01-06","Fr"," Hl. drei Könige",null,"","00:00:00",null,null,"",0,"",null,null,"",null,null,"2023-01-06",true,"","F","F",0,0,0,true,false,false,"07:00:00","08:00:00","09:00:00","12:00:00","16:00:00","18:00:00",false,false,false,true,false,false,false,"00:00:00","23:59:00","00:00:00","23:59:00",true,false,true,false,false,false,false,"","","","",true,false,true,false,0]
["2023-01-07","Sa"," Wochenende",null,"","00:00:00",null,null,"",0,"",null,null,"",null,null,"2023-01-07",true,"","F","A",0,0,0,true,false,false,"","","","","","",false,false,false,true,true,false,false,"00:00:00","23:59:00","00:00:00","23:59:00",true,false,true,false,false,false,false,"00:00:00","23:59:00","00:00:00","23:59:00",true,false,true,false,0]
["2023-01-08","So"," Wochenende",null,"","00:00:00",null,null,"",0,"",null,null,"",null,null,"2023-01-08",true,"","F","F",0,0,0,true,false,false,"","","","","","",false,false,false,true,false,false,false,"00:00:00","23:59:00","00:00:00","23:59:00",true,false,true,false,false,false,false,"","","","",true,false,true,false,0]
["2023-01-09","Mo"," ",null,"08:00-16:00","08:00:00",null,null,"",0,"",null,null,"",null,null,"2023-01-09",true,"","A","A",0,-0.33333333333333298,0,false,false,true,"07:00:00","08:00:00","09:00:00","14:00:00","16:00:00","18:00:00",false,true,false,true,false,false,false,"00:00:00","23:59:00","00:00:00","23:59:00",true,false,true,false,false,false,false,"","","","",true,false,true,false,0]
["2023-01-10","Di"," ",null,"08:00-16:00","08:00:00",null,null,"",0,"",null,null,"",null,null,"2023-01-10",true,"","A","A",0,-0.33333333333333298,0,false,false,true,"07:00:00","08:00:00","09:00:00","14:00:00","16:00:00","18:00:00",false,true,false,true,false,false,false,"00:00:00","23:59:00","00:00:00","23:59:00",true,false,true,false,false,false,false,"","","","",true,false,true,false,0]
["2023-01-11","Mi"," ",null,"08:00-16:00","08:00:00",null,null,"",0,"",null,null,"",null,null,"2023-01-11",true,"","A","A",0,-0.33333333333333298,0,false,false,true,"07:00:00","08:00:00","09:00:00","14:00:00","16:00:00","18:00:00",false,true,false,true,false,false,false,"00:00:00","23:59:00","00:00:00","23:59:00",true,false,true,false,false,false,false,"","","","",true,false,true,false,0]
["2023-01-12","Do"," ",null,"08:00-16:00","08:00:00",null,null,"",0,"",null,null,"",null,null,"2023-01-12",true,"","A","A",0,-0.33333333333333298,0,false,false,true,"07:00:00","08:00:00","09:00:00","14:00:00","16:00:00","18:00:00",false,true,false,true,false,false,false,"00:00:00","23:59:00","00:00:00","23:59:00",true,false,true,false,false,false,false,"","","","",true,false,true,false,0]
["2023-01-13","Fr"," ",null,"08:00-16:00","08:00:00",null,null,"",0,"",null,null,"",null,null,"2023-01-13",true,"","A","A",0,-0.33333333333333298,0,false,false,true,"07:00:00","08:00:00","09:00:00","12:00:00","16:00:00","18:00:00",false,true,false,true,false,false,false,"00:00:00","23:59:00","00:00:00","23:59:00",true,false,true,false,false,false,false,"","","","",true,false,true,false,0]
["2023-01-14","Sa"," Wochenende",null,"","00:00:00",null,null,"",0,"",null,null,"",null,null,"2023-01-14",true,"","F","A",0,0,0,true,false,false,"","","","","","",false,false,false,true,true,false,false,"00:00:00","23:59:00","00:00:00","23:59:00",true,false,true,false,false,false,false,"00:00:00","23:59:00","00:00:00","23:59:00",true,false,true,false,0]
["2023-01-15","So"," Wochenende",null,"","00:00:00",null,null,"",0,"",null,null,"",null,null,"2023-01-15",true,"","F","F",0,0,0,true,false,false,"","","","","","",false,false,false,true,false,false,false,"00:00:00","23:59:00","00:00:00","23:59:00",true,false,true,false,false,false,false,"","","","",true,false,true,false,0]
["2023-01-16","Mo"," ",null,"08:00-16:00","08:00:00",null,null,"",0,"",null,null,"",null,null,"2023-01-16",true,"","A","A",0,-0.33333333333333298,0,false,false,true,"07:00:00","08:00:00","09:00:00","14:00:00","16:00:00","18:00:00",false,true,false,true,false,false,false,"00:00:00","23:59:00","00:00:00","23:59:00",true,false,true,false,false,false,false,"","","","",true,false,true,false,0]
["2023-01-17","Di"," ",null,"08:00-16:00","08:00:00",null,null,"",0,"",null,null,"",null,null,"2023-01-17",true,"","A","A",0,-0.33333333333333298,0,false,false,true,{"$f":"IF(ISNA(VLOOKUP($B24,GAZ,AB$7,FALSE)),\"\",VLOOKUP($B24,GAZ,AB$7,FALSE))","v":"07:00:00"},"08:00:00","09:00:00","14:00:00","16:00:00","18:00:00",false,true,false,true,false,false,false,"00:00:00","23:59:00","00:00:00","23:59:00",true,false,true,false,false,false,false,"","","","",true,false,true,false,0]
["2023-01-18","Mi"," ",null,"08:00-16:00","08:00:00",null,null,"",0,"",null,null,"",null,null,"2023-01-18",true,"","A","A",0,-0.33333333333333298,0,false,false,true,"07:00:00","08:00:00","09:00:00","14:00:00","16:00:00","18:00:00",false,true,false,true,false,false,false,"00:00:00","23:59:00","00:00:00","23:59:00",true,false,true,false,false,false,false,"","","","",true,false,true,false,0]
["2023-01-19","Do"," ",null,"08:00-16:00","08:00:00",null,null,"",0,"",null,null,"",null,null,"2023-01-19",true,"","A","A",0,-0.33333333333333298,0,false,false,true,"07:00:00","08:00:00","09:00:00","14:00:00","16:00:00","18:00:00",false,true,false,true,false,false,false,"00:00:00","23:59:00","00:00:00","23:59:00",true,false,true,false,false,false,false,"","","","",true,false,true,false,0]
["2023-01-20","Fr"," ",null,"08:00-16:00","08:00:00",null,null,"",0,"",null,null,"",null,null,"2023-01-20",true,"","A","A",0,-0.33333333333333298,0,false,false,true,"07:00:00","08:00:00","09:00:00","12:00:00","16:00:00","18:00:00",false,true,false,true,false,false,false,"00:00:00","23:59:00","00:00:00","23:59:00",true,false,true,false,false,false,false,"","","","",true,false,true,false,0]
["2023-01-21","Sa"," Wochenende",null,"","00:00:00",null,null,"",0,"",null,null,"",null,null,"2023-01-21",true,"","F","A",0,0,0,true,false,false,"","","","","","",false,false,false,true,true,false,false,"00:00:00","23:59:00","00:00:00","23:59:00",true,false,true,false,false,false,false,"00:00:00","23:59:00","00:00:00","23:59:00",true,false,true,false,0]
["2023-01-22","So"," Wochenende",null,"","00:00:00",null,null,"",0,"",null,null,"",null,null,"2023-01-22",true,"","F","F",0,0,0,true,false,false,"","","","","","",false,false,false,true,false,false,false,"00:00:00","23:59:00","00:00:00","23:59:00",true,false,true,false,false,false,false,"","","","",true,false,true,false,0]
["2023-01-23","Mo"," ",null,"08:00-16:00","08:00:00",null,null,"",0,"",null,null,"",null,null,"2023-01-23",true,"","A","A",0,-0.33333333333333298,0,false,false,true,"07:00:00","08:00:00","09:00:00","14:00:00","16:00:00","18:00:00",false,true,false,true,false,false,false,"00:00:00","23:59:00","00:00:00","23:59:00",true,false,true,false,false,false,false,"","","","",true,false,true,false,0]
["2023-01-24","Di"," ",null,"08:00-16:00","08:00:00",null,null,"",0,"",null,null,"",null,null,"2023-01-24",true,"","A","A",0,-0.33333333333333298,0,false,false,true,"07:00:00","08:00:00","09:00:00","14:00:00","16:00:00","18:00:00",false,true,false,true,false,false,false,"00:00:00","23:59:00","00:00:00","23:59:00",true,false,true,false,false,false,false,"","","","",true,false,true,false,0]
["2023-01-25","Mi"," ",null,"08:00-16:00","08:00:00",null,null,"",0,"",null,null,"",null,null,"2023-01-25",true,"","A","A",0,-0.33333333333333298,0,false,false,true,"07:00:00","08:00:00","09:00:00","14:00:00","16:00:00","18:00:00",false,true,false,true,false,false,false,"00:00:00","23:59:00","00:00:00","23:59:00",true,false,true,false,false,false,false,"","","","",true,false,true,false,0]
["2023-01-26","Do"," ",null,"08:00-16:00","08:00:00",null,null,"",0,"",null,null,"",null,null,"2023-01-26",true,"","A","A",0,-0.33333333333333298,0,false,false,true,"07:00:00","08:00:00","09:00:00","14:00:00","16:00:00","18:00:00",false,true,false,true,false,false,false,"00:00:00","23:59:00","00:00:00","23:59:00",true,false,true,false,false,false,false,"","","","",true,false,true,false,0]
["2023-01-27","Fr"," ",null,"08:00-16:00","08:00:00",null,null,"",0,"",null,null,"",null,null,"2023-01-27",true,"","A","A",0,-0.33333333333333298,0,false,false,true,"07:00:00","08:00:00","09:00:00","12:00:00","16:00:00","18:00:00",false,true,false,true,false,false,false,"00:00:00","23:59:00","00:00:00","23:59:00",true,false,true,false,false,false,false,"","","","",true,false,true,false,0]
["2023-01-28","Sa"," Wochenende",null,"","00:00:00",null,null,"",0,"",null,null,"",null,null,"2023-01-28",true,"","F","A",0,0,0,true,false,false,"","","","","","",false,false,false,true,true,false,false,"00:00:00","23:59:00","00:00:00","23:59:00",true,false,true,false,false,false,false,"00:00:00","23:59:00","00:00:00","23:59:00",true,false,true,false,0]
["2023-01-29","So"," Wochenende",null,"","00:00:00",null,null,"",0,"",null,null,"",null,null,"2023-01-29",true,"","F","F",0,0,0,true,false,false,"","","","","","",false,false,false,true,false,false,false,"00:00:00","23:59:00","00:00:00","23:59:00",true,false,true,false,false,false,false,"","","","",true,false,true,false,0]
["2023-01-30","Mo"," ",null,"08:00-16:00","08:00:00",null,null,"",0,"",null,null,"",null,null,"2023-01-30",true,"","A","A",0,-0.33333333333333298,0,false,false,true,"07:00:00","08:00:00","09:00:00","14:00:00","16:00:00","18:00:00",false,true,false,true,false,false,false,"00:00:00","23:59:00","00:00:00","23:59:00",true,false,true,false,false,false,false,"","","","",true,false,true,false,0]
["2023-01-31","Di"," ",null,"08:00-16:00","08:00:00",null,null,"",{"$f":"IF($R38,$X38,\"\")","v":0},"",null,null,"",null,null,"2023-01-31",true,"","A","A",0,-0.33333333333333298,0,false,false,true,"07:00:00","08:00:00","09:00:00","14:00:00","16:00:00","18:00:00",false,true,false,true,false,false,false,"00:00:00","23:59:00","00:00:00","23:59:00",true,false,true,false,false,false,false,"","","","",true,false,true,false,0]
["Arbeitstage",{"$f":"COUNTIF(T$8:T$38,\"A\")","v":21},null,null,{"$f":"\"Saldo Monat (~15min) > \"","v":"Saldo Monat (~15min) > "},null,null,null,{"$f":"ROUND(SUM(I8:I38)*4,0)/4","v":0},null,{"$f":"SUM(K8:K38)","v":0}," < ÜS1:2",null,{"$f":"SUM(N8:N38)","v":0},{"$f":"IF(Zeitmodell=\"Vollzeit\",\" < ÜS1:1,5 \",\" < ÜS1:1,25 \")&Zeitmodell","v":" < ÜS1:1,5 Vollzeit"},null,"Zeitmodell Text"]
["Freie Tage",{"$f":"COUNTIF(T$8:T$38,\"F\")","v":10},null,null,{"$f":"\"Saldo \"&IF(Zeitmodell=\"Vollzeit\",\"1:1,5\",\"1:1,25\")& \" (~15min) > \"","v":"Saldo 1:1,5 (~15min) > "},null,null,null,{"$f":"ROUND($N40*4,0)/4","v":0},null,null,null,null,{"$f":"IF(Zeitmodell=\"Vollzeit\",$N39*1.5,$N39*1.25)","v":0},{"$f":"IF(Zeitmodell=\"Vollzeit\",\" < 1:1,5 \",\" < 1:1,25 \")&$Q40","v":" < 1:1,5 Stunden berechnen"},null,"Stunden berechnen"]
["ZK-Tage",0,null,null,"Saldo 1:2 (~15min) > ",null,null,null,{"$f":"ROUND($N41*4,0)/4","v":0},null,null,null,null,{"$f":"K39*2","v":0}," < 1:2    Stunden berechnen"]
["ZA-Tage",{"$f":"COUNTIF(D$8:D$38,\"Z\")","v":0},null,null," Saldo Vormonat > ",null,null,null,{"$f":"$J5","v":0},null,null,null,null,null,null,null,"Gültigkeit ausbezahlt"]
["Urlaubstage",{"$f":"COUNTIF(D$8:D$38,\"U\")","v":0},null,null," Saldo Gesamt > ",null,null,null,{"$f":"SUM(I39:I42)","v":0},null,{"$f":"IF($I$43>=$R$2,\"< Hier ausbezahlte Std. eingeben. (Die Eingabe ist hier erst ab   < einem Saldo von \"&TEXT($R$2,\"#.##0,00\")&\" Std., und nur in 0,25-Schritten möglich.)\",\"\")","v":""},null,null,null,null,null,{"$f":"IF(AND($J$43<>\"\",NOT(ISNUMBER($J$43))),FALSE,OR(AND($J$43>=0,$J$43<=$I$43,MOD($J$43,0.25)=0),$J$43=\"\"))","v":true}]
["Krank",{"$f":"COUNTIF(D$8:D$38,\"K\")","v":0},null,null," Saldo Übertrag > ",null,null,null,{"$f":"$I43-$J43","v":0},{"$f":"\" < Dieser Stunden-Saldo wird in das nächste \"&IF($Q$3=\"Dezember\",\"Jahr\",\"Monat\")&\" übertragen\"","v":" < Dieser Stunden-Saldo wird in das nächste Monat übertragen"}]
[null,null,null,"Z"]
[]
[]
[{"$f":"\"Unterschrift von \"&Vorgesetzter","v":"Unterschrift von Vorname Nachname"},null,null,null,null,null,null,null,null,null,null,{"$f":"\"Unterschrift von \"&Name","v":"Unterschrift von Vorname Nachname"}]

{"sheet":"FormatAlt","index":19,"n_rows":48,"n_cols":60,"rows_kept":48,"cut":false,"hidden":true,"merged":[[1,5,1,7],[2,5,2,7],[46,4,46,7],[0,15,1,15],[39,14,39,15],[44,4,44,7],[39,4,39,7],[41,4,41,7],[5,7,6,7],[3,6,3,8],[42,10,42,15],[3,0,3,3],[3,14,6,14],[3,4,3,5],[3,15,6,15],[40,14,40,15],[4,1,6,1],[4,4,4,5],[5,11,6,11],[5,12,6,12],[38,2,43,3],[43,4,43,7],[5,27,5,32],[42,4,42,7],[38,4,38,7],[47,0,47,3],[47,12,47,15],[4,0,6,0],[5,13,6,13],[5,6,6,6],[5,5,6,5],[5,3,6,3],[5,2,6,2],[4,2,4,3],[4,6,4,8],[38,14,38,15],[5,10,6,10],[41,10,41,15]]}
[" BOKU-Zeiterfassung für Allgemeines Personal",null,null,null,null,null,null,null,null,null,null,null,null,null,null,null,"Monat","Stunden-Saldo Grenzen","Status Blatteingabe"]
[{"$f":"\" Org.-Einh. : \"&OrgEinheit","v":" Org.-Einh. : HXXXXX"},null,null,null,null,"Zeitmodell:",null,null,{"$f":"\" \"&Zeitmodell","v":" Vollzeit"},null,null,null,null,null,null,null,{"$f":"IF(ISNA($Q$4),1,$Q$4)","v":1},{"$f":"IF($Q$2=12,NormalOGDez,NormalOG)","v":71.999999999999986},{"$f":"SUM($BH8:$BH38)","v":0}]
[{"$f":" \" Mitarbeiter/in: \"&Name","v":" Mitarbeiter/in: Vorname Nachname"},null,null,null,null,"Vorgesetzte/r:",null,null,{"$f":"\" \"&Vorgesetzter","v":" Vorname Nachname"},null,null,null,null,null,null,null,{"$f":"RIGHT(CELL(\"filename\",A1),LEN(CELL(\"filename\",A1))-SEARCH(\"]\",CELL(\"filename\",A1),1))","v":"FormatAlt"},{"$f":"IF($Q$2=12,NormalUGDez,NormalUG)","v":-24},{"$f":"IF($Q$2=1,$S$2,$S$2+INDIRECT($S$5))","v":0}]
[{"$f":" \" Monat: \"&$Q$3&\" \"&Jahr","v":" Monat: FormatAlt 2023"},null,null,null,"Dienstplan",null,"Normalstunden",null,null,"Übertrag"," Überstundenberechnung",null,null,null,"Unterschrift  Vorgesetzte/r","Anmerkungen \n(z.B. Überstunden- notwendigkeit)",{"$f":"IF(ISNA(VLOOKUP($Q$3,MTab,2,FALSE)),1,VLOOKUP($Q$3,MTab,2,FALSE))","v":1},null,"Übertrags Adresse Blatteingabe"]
[" Datum","Wochentag","Tagesinformationen",null,{"$f":"\"Wochen-AZ\"&\" \"&TEXT(WAZ,\"[hh]:mm\")","v":"Wochen-AZ 40:00"},null," Stunden 1:1, ÜS1:2",null,null,{"$f":"IF(ISNA($Q$5),Übertrag,INDIRECT($Q$5))","v":0},"ÜS1:2",{"$f":"IF(Zeitmodell=\"Vollzeit\",\" Überstunden1:1,5\",\" Überstunden1:1,25\")","v":" Überstunden1:1,5"},null,null,null,null,{"$f":"IF(ISNA(VLOOKUP($Q$3,MTab,3,FALSE)),\"Übertrag\",VLOOKUP($Q$3,MTab,3,FALSE))","v":"Übertrag"},null,{"$f":"IF(ISNA(VLOOKUP($Q$3,MTab,4,FALSE)),$Q$3&\"!$R$2\",VLOOKUP($Q$3,MTab,4,FALSE))","v":"FormatAlt!$R$2"}]
[null,null," Feiertage\n Wochenende\n Urlaub, ZA, Krank","[U]rlaub\n[Z]A\n[ZK]\n[K]rank","Normal-","Soll","Von","Bis","Plus","Saldo","Plus","Von","Bis","Plus",null,null,"Hintergrundberechnungen",null,null,null,null,null,null,"Saldo aktuell",null,null,null,"GAZ-Tabellenabbildung",null,null,null,null,null,"Eingabebeprüfungen"]
[null,null,null,null,"Arbeitszeit",null,null,null,"Minus","akuell",null,null,null,null,null,null,"Datum","Monat OK","Abwesenh.","Freie Tage","ÜA-Tage","Std.","Soll-Std.",{"$f":"IF(ISNA($Q$5),Übertrag,INDIRECT($Q$5))","v":0},"Std.-Soll = 0","Std.-Soll > 0","Std.-Soll < 0",{"$f":"I_GAZGRVon","v":2},{"$f":"I_GAZNAZVon","v":3},{"$f":"I_GAZKVon","v":4},{"$f":"I_GAZKBis","v":6},{"$f":"I_GAZNAZBis","v":7},{"$f":"I_GAZGRBis","v":8},"Zeiteingabe","UZK-Eing.\nerlaubt","UZK-Eing.\ngültig","Normalst. ein erlaubt","Überstd. ein erlaubt","Normalstd.\neingegeben","Überstd.\neingegeben","Normal VON möglich OG","Normal VON möglich UG","Normal BIS möglich OG","Normal BIS möglich UG","Normal VON\n15min","Normal VON richtig","Normal BIS\n15min","Normal BIS richtig","ZA-Kern Von","ZA-Kern Bis","ZA-Kern","Über VON Obergrenze","Über VON Untergrenze","Über BIS Obergrenze","Über BIS Untergrenze","Über VON\n15min","Über VON richtig","Überl BIS\n15min","Über BIS richtig","Status Zeilen Eingabe"]
[{"$f":"IF($R8,TEXT($Q8,\"TT.MM.JJJJ\"),\"\")","v":"01.01.2023"},{"$f":"IF($R8,TEXT($Q8,\"ttt\"),\"\")","v":"So"},{"$f":"IF($R8,\" \"&IF($S8=\"\",VLOOKUP($Q8,FListe,3,FALSE),$S8),\"\")","v":" Neujahrstag"},null,{"$f":"IF(AND($R8,$T8<>\"F\"),IF($AC8=$AF8,\"keine NAZ\",TEXT($AC8,\"hh:mm\")&\"-\"&TEXT($AF8,\"hh:mm\")),\"\")","v":""},{"$f":"IF($R8,IF($T8=\"F\",0,VLOOKUP($B8,GAZ,I_GAZNAZ,FALSE)),\"\")","v":"00:00:00"},null,null,{"$f":"IF($U8=\"F\",\"\",IF(AND($R8,$AM8,NOT($Y8)),ROUND(($V8-$F8)*24,2),IF($D8=\"Z\",$F8*-24,\"\")))","v":""},{"$f":"$X8","v":0},{"$f":"IF(AND($U8=\"F\",$AM8),ROUND($V8*24,2),\"\")","v":""},null,null,{"$f":"IF(AND($R8,$AN8,$M8-$L8<>0,$AL8),ROUND(($M8-$L8)*24,2),\"\")","v":""},null,null,{"$f":"DATE(Jahr,$Q2,1)","v":"2023-01-01"},{"$f":"$Q$2=MONTH($Q8)","v":true},{"$f":"IF(OR($D8=\"U\",$D8=\"Z\",$D8=\"ZK\",$D8=\"K\"),VLOOKUP($D8,UZK,2,FALSE),\"\")","v":""},{"$f":"VLOOKUP($Q8,FListe,4,FALSE)","v":"F"},{"$f":"VLOOKUP($Q8,FListe,5,FALSE)","v":"F"},{"$f":"$H8-$G8","v":0},{"$f":"IF($R8,$V8-$F8,\"\")","v":0},{"$f":"IF($I8<>\"\",$X7+$I8,$X7)","v":0},{"$f":"($W8=0)","v":true},{"$f":"($W8>0)","v":false},{"$f":"($W8<0)","v":false},{"$f":"IF(ISNA(VLOOKUP($B8,GAZ,AB$7,FALSE)),\"\",VLOOKUP($B8,GAZ,AB$7,FALSE))","v":""},"",{"$f":"IF(ISNA(VLOOKUP($B8,GAZ,AD$7,FALSE)),\"\",IF($AC8=$AF8,$G8,VLOOKUP($B8,GAZ,AD$7,FALSE)))","v":""},{"$f":"IF(ISNA(VLOOKUP($B8,GAZ,AE$7,FALSE)),\"\",IF($AC8=$AF8,$H8,VLOOKUP($B8,GAZ,AE$7,FALSE)))","v":""},{"$f":"IF(ISNA(VLOOKUP($B8,GAZ,AF$7,FALSE)),\"\",VLOOKUP($B8,GAZ,AF$7,FALSE))","v":""},"",{"$f":"OR($G8<>\"\",$H8<>\"\",$L8<>\"\",$M8<>\"\")","v":false},{"$f":"AND($T8<>\"F\",NOT($AH8),NOT($AC8=$AF8))","v":false},{"$f":"AND($AI8,OR($D8=\"U\",$D8=\"Z\",$D8=\"K\"))","v":false},{"$f":"AND($D8<>\"U\",$D8<>\"Z\",$D8<>\"K\",$R8)","v":true},{"$f":"AND($U8<>\"F\",OR($B8=\"Sa\",AND($AM8,$I8>=0,NOT($AY8))))","v":false},{"$f":"AND($G8<>\"\",$H8<>\"\")","v":false},{"$f":"AND($L8<>\"\",$M8<>\"\")","v":false},{"$f":"IF($AK8,TagUG,\"\")","v":"00:00:00"},{"$f":"IF($AK8,IF($H8=\"\",IF(AND($L8<>\"\",$L8<$AG8),$L8,IF(AND($M8<>\"\",$M8<$AG8),$M8,TagOG)),$H8),\"\")","v":"23:59:00"},{"$f":"IF($AK8,IF($G8=\"\",$AB8,$G8),\"\")","v":""},{"$f":"IF($AK8,IF(AND($L8<>\"\",$L8<$AG8),$L8,IF(AND($M8<>\"\",$M8<$AG8),$M8,TagOG)),\"\")","v":"23:59:00"},{"$f":"MOD($G8*24,0.25)=0","v":true},{"$f":"AND($AK8,ISNUMBER($G8),$G8>=$AO8,$G8<=$AP8)","v":false},{"$f":"MOD($H8*24,0.25)=0","v":true},{"$f":"AND($AK8,ISNUMBER($H8),$H8>=$AQ8,$H8<=$AR8)","v":false},{"$f":"AND($G8<>\"\",$G8>$AD8)","v":false},{"$f":"AND($H8<>\"\",$H8<$AE8)","v":false},{"$f":"AND($U8<>\"F\",OR($AW8,$AX8))","v":false},{"$f":"IF($AL8,IF(AND($H8<>\"\",$H8>$AF8),$H8,$AF8),\"\")","v":""},{"$f":"IF($AL8,IF($M8<>\"\",$M8,$BC8),\"\")","v":""},{"$f":"IF($AL8,IF($L8<>\"\",$L8,IF(AND($H8<>\"\",$H8>$AF8),$H8,$AF8)),\"\")","v":""},{"$f":"IF($AL8,TIME(23,59,0),\"\")","v":""},{"$f":"MOD($L8*24,0.25)=0","v":true},{"$f":"AND($AL8,ISNUMBER($L8),$L8>=$AZ8,$BA8>=$L8)","v":false},{"$f":"MOD($M8*24,0.25)=0","v":true},{"$f":"AND($AL8,ISNUMBER($M8),$M8>=$BB8,$M8<=$BC8)","v":false},{"$f":"IF(AND(ISBLANK($D8),ISBLANK($G8),ISBLANK($H8),ISBLANK($L8),ISBLANK($M8),ISBLANK($P8)),0,1)","v":0}]
["02.01.2023","Mo"," ",null,"08:00-16:00","08:00:00",null,null,{"$f":"IF($U9=\"F\",\"\",IF(AND($R9,$AM9,NOT($Y9)),ROUND(($V9-$F9)*24,2),IF($D9=\"Z\",$F9*-24,\"\")))","v":""},0,{"$f":"IF(AND($U9=\"F\",$AM9),ROUND($V9*24,2),\"\")","v":""},null,null,{"$f":"IF(AND($R9,$AN9,$M9-$L9<>0,$AL9),ROUND(($M9-$L9)*24,2),\"\")","v":""},null,null,{"$f":" Q8+1","v":"2023-01-02"},true,"","A","A",0,-0.33333333333333331,0,false,false,true,"07:00:00","08:00:00","09:00:00","14:00:00","16:00:00","18:00:00",false,true,false,{"$f":"AND($D9<>\"U\",$D9<>\"Z\",$D9<>\"K\",$R9)","v":true},{"$f":"AND($U9<>\"F\",OR($B9=\"Sa\",AND($AM9,$I9>=0,NOT($AY9))))","v":false},false,false,"00:00:00","23:59:00",{"$f":"IF($AK9,IF($G9=\"\",TagUG,$G9),\"\")","v":"00:00:00"},"23:59:00",true,false,true,false,false,false,{"$f":"AND($U9<>\"F\",OR($AW9,$AX9))","v":false},"","","","",true,false,true,false,0]
["03.01.2023","Di"," ",null,"08:00-16:00","08:00:00",null,null,"",0,"",null,null,"",null,null,"2023-01-03",true,"","A","A",0,-0.33333333333333331,0,false,false,true,"07:00:00","08:00:00","09:00:00","14:00:00","16:00:00","18:00:00",false,true,false,true,false,false,false,"00:00:00","23:59:00","00:00:00","23:59:00",true,false,true,false,false,false,false,"","","","",true,false,true,false,0]
["04.01.2023","Mi"," ",null,"08:00-16:00","08:00:00",null,null,"",0,"",null,null,"",null,null,"2023-01-04",true,"","A","A",0,-0.33333333333333331,0,false,false,true,"07:00:00","08:00:00","09:00:00","14:00:00","16:00:00","18:00:00",false,true,false,true,false,false,false,"00:00:00","23:59:00","00:00:00","23:59:00",true,false,true,false,false,false,false,"","","","",true,false,true,false,0]
["05.01.2023","Do"," ",null,"08:00-16:00","08:00:00",null,null,"",0,"",null,null,"",null,null,"2023-01-05",true,"","A","A",0,-0.33333333333333331,0,false,false,true,"07:00:00","08:00:00","09:00:00","14:00:00","16:00:00","18:00:00",false,true,false,true,false,false,false,"00:00:00","23:59:00","00:00:00","23:59:00",true,false,true,false,false,false,false,"","","","",true,false,true,false,0]
["06.01.2023","Fr"," Hl. drei Könige",null,"","00:00:00",null,null,"",0,"",null,null,"",null,null,"2023-01-06",true,"","F","F",0,0,0,true,false,false,"07:00:00","08:00:00","09:00:00","12:00:00","16:00:00","18:00:00",false,false,false,true,false,false,false,"00:00:00","23:59:00","00:00:00","23:59:00",true,false,true,false,false,false,false,"","","","",true,false,true,false,0]
["07.01.2023","Sa"," Wochenende",null,"","00:00:00",null,null,"",0,"",null,null,"",null,null,"2023-01-07",true,"","F","A",0,0,0,true,false,false,"","","","","","",false,false,false,true,true,false,false,"00:00:00","23:59:00","00:00:00","23:59:00",true,false,true,false,false,false,false,"","23:59:00","","23:59:00",true,false,true,false,0]
["08.01.2023","So"," Wochenende",null,"","00:00:00",null,null,"",0,"",null,null,"",null,null,"2023-01-08",true,"","F","F",0,0,0,true,false,false,"","","","","","",false,false,false,true,false,false,false,"00:00:00","23:59:00","00:00:00","23:59:00",true,false,true,false,false,false,false,"","","","",true,false,true,false,0]
["09.01.2023","Mo"," ",null,"08:00-16:00","08:00:00",null,null,"",0,"",null,null,"",null,null,"2023-01-09",true,"","A","A",0,-0.33333333333333331,0,false,false,true,"07:00:00","08:00:00","09:00:00","14:00:00","16:00:00","18:00:00",false,true,false,true,false,false,false,"00:00:00","23:59:00","00:00:00","23:59:00",true,false,true,false,false,false,false,"","","","",true,false,true,false,0]
["10.01.2023","Di"," ",null,"08:00-16:00","08:00:00",null,null,"",0,"",null,null,"",null,null,"2023-01-10",true,"","A","A",0,-0.33333333333333331,0,false,false,true,"07:00:00","08:00:00","09:00:00","14:00:00","16:00:00","18:00:00",false,true,false,true,false,false,false,"00:00:00","23:59:00","00:00:00","23:59:00",true,false,true,false,false,false,false,"","","","",true,false,true,false,0]
["11.01.2023","Mi"," ",null,"08:00-16:00","08:00:00",null,null,"",0,"",null,null,"",null,null,"2023-01-11",true,"","A","A",0,-0.33333333333333331,0,false,false,true,"07:00:00","08:00:00","09:00:00","14:00:00","16:00:00","18:00:00",false,true,false,true,false,false,false,"00:00:00","23:59:00","00:00:00","23:59:00",true,false,true,false,false,false,false,"","","","",true,false,true,false,0]
["12.01.2023","Do"," ",null,"08:00-16:00","08:00:00",null,null,"",0,"",null,null,"",null,null,"2023-01-12",true,"","A","A",0,-0.33333333333333331,0,false,false,true,"07:00:00","08:00:00","09:00:00","14:00:00","16:00:00","18:00:00",false,true,false,true,false,false,false,"00:00:00","23:59:00","00:00:00","23:59:00",true,false,true,false,false,false,false,"","","","",true,false,true,false,0]
["13.01.2023","Fr"," ",null,"08:00-16:00","08:00:00",null,null,"",0,"",null,null,"",null,null,"2023-01-13",true,"","A","A",0,-0.33333333333333331,0,false,false,true,"07:00:00","08:00:00","09:00:00","12:00:00","16:00:00","18:00:00",false,true,false,true,false,false,false,"00:00:00","23:59:00","00:00:00","23:59:00",true,false,true,false,false,false,false,"","","","",true,false,true,false,0]
["14.01.2023","Sa"," Wochenende",null,"","00:00:00",null,null,"",0,"",null,null,"",null,null,"2023-01-14",true,"","F","A",0,0,0,true,false,false,"","","","","","",false,false,false,true,true,false,false,"00:00:00","23:59:00","00:00:00","23:59:00",true,false,true,false,false,false,false,"","23:59:00","","23:59:00",true,false,true,false,0]
["15.01.2023","So"," Wochenende",null,"","00:00:00",null,null,"",0,"",null,null,"",null,null,"2023-01-15",true,"","F","F",0,0,0,true,false,false,"","","","","","",false,false,false,true,false,false,false,"00:00:00","23:59:00","00:00:00","23:59:00",true,false,true,false,false,false,false,"","","","",true,false,true,false,0]
["16.01.2023","Mo"," ",null,"08:00-16:00","08:00:00",null,null,"",0,"",null,null,"",null,null,"2023-01-16",true,"","A","A",0,-0.33333333333333331,0,false,false,true,"07:00:00","08:00:00","09:00:00","14:00:00","16:00:00","18:00:00",false,true,false,true,false,false,false,"00:00:00","23:59:00","00:00:00","23:59:00",true,false,true,false,false,false,false,"","","","",true,false,true,false,0]
["17.01.2023","Di"," ",null,"08:00-16:00","08:00:00",null,null,"",0,"",null,null,"",null,null,"2023-01-17",true,"","A","A",0,-0.33333333333333331,0,false,false,true,"07:00:00","08:00:00","09:00:00","14:00:00","16:00:00","18:00:00",false,true,false,true,false,false,false,"00:00:00","23:59:00","00:00:00","23:59:00",true,false,true,false,false,false,false,"","","","",true,false,true,false,0]
["18.01.2023","Mi"," ",null,"08:00-16:00","08:00:00",null,null,"",0,"",null,null,"",null,null,"2023-01-18",true,"","A","A",0,-0.33333333333333331,0,false,false,true,"07:00:00","08:00:00","09:00:00","14:00:00","16:00:00","18:00:00",false,true,false,true,false,false,false,"00:00:00","23:59:00","00:00:00","23:59:00",true,false,true,false,false,false,false,"","","","",true,false,true,false,0]
["19.01.2023","Do"," ",null,"08:00-16:00","08:00:00",null,null,"",0,"",null,null,"",null,null,"2023-01-19",true,"","A","A",0,-0.33333333333333331,0,false,false,true,"07:00:00","08:00:00","09:00:00","14:00:00","16:00:00","18:00:00",false,true,false,true,false,false,false,"00:00:00","23:59:00","00:00:00","23:59:00",true,false,true,false,false,false,false,"","","","",true,false,true,false,0]
["20.01.2023","Fr"," ",null,"08:00-16:00","08:00:00",null,null,"",0,"",null,null,"",null,null,"2023-01-20",true,"","A","A",0,-0.33333333333333331,0,false,false,true,"07:00:00","08:00:00","09:00:00","12:00:00","16:00:00","18:00:00",false,true,false,true,false,false,false,"00:00:00","23:59:00","00:00:00","23:59:00",true,false,true,false,false,false,false,"","","","",true,false,true,false,0]
["21.01.2023","Sa"," Wochenende",null,"","00:00:00",null,null,"",0,"",null,null,"",null,null,"2023-01-21",true,"","F","A",0,0,0,true,false,false,"","","","","","",false,false,false,true,true,false,false,"00:00:00","23:59:00","00:00:00","23:59:00",true,false,true,false,false,false,false,"","23:59:00","","23:59:00",true,false,true,false,0]
["22.01.2023","So"," Wochenende",null,"","00:00:00",null,null,"",0,"",null,null,"",null,null,"2023-01-22",true,"","F","F",0,0,0,true,false,false,"","","","","","",false,false,false,true,false,false,false,"00:00:00","23:59:00","00:00:00","23:59:00",true,false,true,false,false,false,false,"","","","",true,false,true,false,0]
["23.01.2023","Mo"," ",null,"08:00-16:00","08:00:00",null,null,"",0,"",null,null,"",null,null,"2023-01-23",true,"","A","A",0,-0.33333333333333331,0,false,false,true,"07:00:00","08:00:00","09:00:00","14:00:00","16:00:00","18:00:00",false,true,false,true,false,false,false,"00:00:00","23:59:00","00:00:00","23:59:00",true,false,true,false,false,false,false,"","","","",true,false,true,false,0]
["24.01.2023","Di"," ",null,"08:00-16:00","08:00:00",null,null,"",0,"",null,null,"",null,null,"2023-01-24",true,"","A","A",0,-0.33333333333333331,0,false,false,true,"07:00:00","08:00:00","09:00:00","14:00:00","16:00:00","18:00:00",false,true,false,true,false,false,false,"00:00:00","23:59:00","00:00:00","23:59:00",true,false,true,false,false,false,false,"","","","",true,false,true,false,0]
["25.01.2023","Mi"," ",null,"08:00-16:00","08:00:00",null,null,"",0,"",null,null,"",null,null,"2023-01-25",true,"","A","A",0,-0.33333333333333331,0,false,false,true,"07:00:00","08:00:00","09:00:00","14:00:00","16:00:00","18:00:00",false,true,false,true,false,false,false,"00:00:00","23:59:00","00:00:00","23:59:00",true,false,true,false,false,false,false,"","","","",true,false,true,false,0]
["26.01.2023","Do"," ",null,"08:00-16:00","08:00:00",null,null,"",0,"",null,null,"",null,null,"2023-01-26",true,"","A","A",0,-0.33333333333333331,0,false,false,true,"07:00:00","08:00:00","09:00:00","14:00:00","16:00:00","18:00:00",false,true,false,true,false,false,false,"00:00:00","23:59:00","00:00:00","23:59:00",true,false,true,false,false,false,false,"","","","",true,false,true,false,0]
["27.01.2023","Fr"," ",null,"08:00-16:00","08:00:00",null,null,"",0,"",null,null,"",null,null,"2023-01-27",true,"","A","A",0,-0.33333333333333331,0,false,false,true,"07:00:00","08:00:00","09:00:00","12:00:00","16:00:00","18:00:00",false,true,false,true,false,false,false,"00:00:00","23:59:00","00:00:00","23:59:00",true,false,true,false,false,false,false,"","","","",true,false,true,false,0]
["28.01.2023","Sa"," Wochenende",null,"","00:00:00",null,null,"",0,"",null,null,"",null,null,"2023-01-28",true,"","F","A",0,0,0,true,false,false,"","","","","","",false,false,false,true,true,false,false,"00:00:00","23:59:00","00:00:00","23:59:00",true,false,true,false,false,false,false,"","23:59:00","","23:59:00",true,false,true,false,0]
["29.01.2023","So"," Wochenende",null,"","00:00:00",null,null,"",0,"",null,null,"",null,null,"2023-01-29",true,"","F","F",0,0,0,true,false,false,"","","","","","",false,false,false,true,false,false,false,"00:00:00","23:59:00","00:00:00","23:59:00",true,false,true,false,false,false,false,"","","","",true,false,true,false,0]
["30.01.2023","Mo"," ",null,"08:00-16:00","08:00:00",null,null,"",0,"",null,null,"",null,null,"2023-01-30",true,"","A","A",0,-0.33333333333333331,0,false,false,true,"07:00:00","08:00:00","09:00:00","14:00:00","16:00:00","18:00:00",false,true,false,true,false,false,false,"00:00:00","23:59:00","00:00:00","23:59:00",true,false,true,false,false,false,false,"","","","",true,false,true,false,0]
["31.01.2023","Di"," ",null,"08:00-16:00","08:00:00",null,null,"",0,"",null,null,"",null,null,"2023-01-31",true,"","A","A",0,-0.33333333333333331,0,false,false,true,"07:00:00","08:00:00","09:00:00","14:00:00","16:00:00","18:00:00",false,true,false,true,false,false,false,"00:00:00","23:59:00","00:00:00","23:59:00",true,false,true,false,false,false,false,"","","","",true,false,true,false,0]
["Arbeitstage",{"$f":"COUNTIF(T$8:T$38,\"<>F\")","v":21},null,null,{"$f":"\"Monat Std.-Saldo (~15min) > \"","v":"Monat Std.-Saldo (~15min) > "},null,null,null,{"$f":"ROUND(SUM(I8:I38)*4,0)/4","v":0},null,{"$f":"SUM(K8:K38)","v":0},null,null,{"$f":"SUM(N8:N38)","v":0},{"$f":"\" < Monat ÜS-Saldo \"&Zeitmodell","v":" < Monat ÜS-Saldo Vollzeit"},null,"Zeitmodell Text"]
["ZK-Tage",{"$f":"COUNTIF(D$8:D$38,\"ZK\")","v":0},null,null,"Überstunden (~15min) > ",null,null,null,{"$f":"ROUND($N40*4,0)/4","v":0},null,null,null,null,{"$f":"IF(Zeitmodell=\"Vollzeit\",$N39*1.5,$N39*1.25)","v":0},{"$f":"IF(Zeitmodell=\"Vollzeit\",\" < 1:1,5 \",\" < 1:1,25 \")&$Q40","v":" < 1:1,5 Stunden berechnen"},null,"Stunden berechnen"]
[null,null,null,null,null,null,null,null,{"$f":"ROUND($N41*4,0)/4","v":0},null,null,null,null,{"$f":"K39*2","v":0}," < 1:2 Stunden berechnen"]
["ZA-Tage",{"$f":"COUNTIF(D$8:D$38,\"Z\")","v":0},null,null," Vormonat Std.Saldo > ",null,null,null,{"$f":"$J5","v":0},null,null,null,null,null,null,null,"Gültigkeit ausbezahlt"]
["Urlaubstage",{"$f":"COUNTIF(D$8:D$38,\"U\")","v":0},null,null," Gesamt Std. Saldo > ",null,null,null,{"$f":"$I39+$I40+$I42","v":0},null,{"$f":"IF($I$43>=$R$2,\"< Hier ausbezahlte Std. eingeben. (Die Eingabe ist hier erst ab   < einem Saldo von \"&TEXT($R$2,\"#.##0,00\")&\" Std., und nur in 0,25-Schritten möglich.)\",\"\")","v":""},null,null,null,null,null,{"$f":"AND($J$43>=0,$J$43<=$I$43,MOD($J$43,0.25)=0)","v":true}]
["Krank",{"$f":"COUNTIF(D$8:D$38,\"K\")","v":0},null,null," Übertrag Std. Saldo > ",null,null,null,{"$f":"$I43-$J43","v":0},{"$f":"\" < Dieser Stunden-Saldo wird in das nächste \"&IF($Q$3=\"Dezember\",\"Jahr\",\"Monat\")&\" übertragen\"","v":" < Dieser Stunden-Saldo wird in das nächste Monat übertragen"}]
[null,null,null,"Z"]
[]
[]
[{"$f":"\"Unterschrift von \"&Vorgesetzter","v":"Unterschrift von Vorname Nachname"},null,null,null,null,null,null,null,null,null,null,null,{"$f":"\"Unterschrift von \"&Name","v":"Unterschrift von Vorname Nachname"}]

{"sheet":"Test","index":20,"n_rows":0,"n_cols":0,"rows_kept":0,"cut":false,"hidden":true,"merged":[]}